Gentoo Logo
Gentoo Spaceship




Note: Due to technical difficulties, the Archives are currently not up to date. GMANE provides an alternative service for most mailing lists.
c.f. bug 424647
List Archive: gentoo-alpha
Navigation:
Lists: gentoo-alpha: < Prev By Thread Next > < Prev By Date Next >
Headers:
To: gentoo-alpha@g.o
From: lgatto <lgatto@...>
Subject: CXX=cxx CXXFLAGS="-host -fast" emerge groff fails
Date: Wed, 23 Jun 2004 10:54:58 +0200
Hello all,
I installed the Compaq-Tools on Gentoo Alpha as descibed on the 'Guide to Compaq-Tools
on Gentoo Alpha' page and tested ccc and c++.
Reemerging gzip with ccc worked fine, but groff failed with c++:

.
.
.
cxx -I. -I/var/tmp/portage/groff-1.18.1-r4/work/groff-1.18.1/src/preproc/tbl -I/var/tmp/portage/groff-1.18.1-r4/work/groff-1.18.1/src/include -I/var/tmp/portage/groff-1.18.1-r4/work/groff-1.18.1/src/include -DHAVE_CONFIG_H -host -fast  -c main.cc
cxx -I. -I/var/tmp/portage/groff-1.18.1-r4/work/groff-1.18.1/src/preproc/tbl -I/var/tmp/portage/groff-1.18.1-r4/work/groff-1.18.1/src/include -I/var/tmp/portage/groff-1.18.1-r4/work/groff-1.18.1/src/include -DHAVE_CONFIG_H -host -fast  -c table.cc
cxx -host -fast  -o tbl main.o table.o /var/tmp/portage/groff-1.18.1-r4/work/groff-1.18.1/src/libs/libgroff/libgroff.a
Making tbl.n from tbl.man
make[2]: Leaving directory `/var/tmp/portage/groff-1.18.1-r4/work/groff-1.18.1/src/preproc/tbl'
make[2]: Entering directory `/var/tmp/portage/groff-1.18.1-r4/work/groff-1.18.1/src/preproc/pic'
cxx -I. -I/var/tmp/portage/groff-1.18.1-r4/work/groff-1.18.1/src/preproc/pic -I/var/tmp/portage/groff-1.18.1-r4/work/groff-1.18.1/src/include -I/var/tmp/portage/groff-1.18.1-r4/work/groff-1.18.1/src/include -DHAVE_CONFIG_H -host -fast  -c pic.cc
cxx: Fatal: A memory access violation (bus error or segmentation fault)
has occurred.  Please submit a problem report.
make[2]: *** [pic.o] Error 1
make[2]: Leaving directory `/var/tmp/portage/groff-1.18.1-r4/work/groff-1.18.1/src/preproc/pic'
make[1]: *** [src/preproc/pic] Error 2
make[1]: Leaving directory `/var/tmp/portage/groff-1.18.1-r4/work/groff-1.18.1'
make: *** [all] Error 2

!!! ERROR: sys-apps/groff-1.18.1-r4 failed.
!!! Function src_compile, Line 85, Exitcode 2
!!! (no error message)

(see Bug 53039 for more information)

Has anyone an idea? Is this likely to happen for other packages?

TIA

-- 
Laurent
enjoy the penguin

--
gentoo-alpha@g.o mailing list

Replies:
Re: CXX=cxx CXXFLAGS="-host -fast" emerge groff fails
-- Brian C. Parkhurst
Navigation:
Lists: gentoo-alpha: < Prev By Thread Next > < Prev By Date Next >
Previous by thread:
Emerge of xorg-x11 failing
Next by thread:
Re: CXX=cxx CXXFLAGS="-host -fast" emerge groff fails
Previous by date:
Emerge of xorg-x11 failing
Next by date:
Re: CXX=cxx CXXFLAGS="-host -fast" emerge groff fails


Updated Jun 17, 2009

Summary: Archive of the gentoo-alpha mailing list.

Donate to support our development efforts.

Copyright 2001-2013 Gentoo Foundation, Inc. Questions, Comments? Contact us.