Gentoo Archives: gentoo-amd64

From: Clemente Aguiar <clemente.aguiar@××××××××××××××××.pt>
To: gentoo-amd64@l.g.o
Subject: [gentoo-amd64] gcc compile failed after 2005.1-r1 instalation
Date: Thu, 08 Dec 2005 12:05:13
Message-Id: 6A0C419392D7BA45BD141D0BA4F253C78B26@loureiro.madeiratecnopolo.pt
I did a new instalattion of Gentoo 2005.r1 (AMD64). 

After the basic stage3 instalation, kernel compilation and reboot,
everything was fine. 
I then decided to recompile all: 

Code:	

emerge -e world 
	

and I get an error when it gets to compile gcc 

Code:	

./xgcc -B./ -B/usr/x86_64-pc-linux-gnu/bin/ -isystem
/usr/x86_64-pc-linux-gnu/include -isystem
/usr/x86_64-pc-linux-gnu/sys-include
-L/var/tmp/portage/gcc-3.4.4-r1/work/build/gcc/../ld -O2  -DIN_GCC    -W
-Wall -Wwrite-strings -Wstrict-prototypes -Wmissing-prototypes
-Wold-style-definition  -isystem ./include  -fPIC -DHAVE_SYSLOG -g
-DHAVE_GTHR_DEFAULT -DIN_LIBGCC2 -D__GCC_FLOAT_NOT_NEEDED
-D_LIBC_PROVIDES_SSP_ -shared -nodefaultlibs -Wl,--soname=libgcc_s.so.1
-Wl,--version-script=libgcc/32/libgcc.map -o 32/libgcc_s.so.1.tmp  -m32
libgcc/32/_muldi3.o libgcc/32/_negdi2.o libgcc/32/_lshrdi3.o
libgcc/32/_ashldi3.o libgcc/32/_ashrdi3.o libgcc/32/_cmpdi2.o
libgcc/32/_ucmpdi2.o libgcc/32/_floatdidf.o libgcc/32/_floatdisf.o
libgcc/32/_fixunsdfsi.o libgcc/32/_fixunssfsi.o libgcc/32/_fixunsdfdi.o
libgcc/32/_fixdfdi.o libgcc/32/_fixunssfdi.o libgcc/32/_fixsfdi.o
libgcc/32/_fixxfdi.o libgcc/32/_fixunsxfdi.o libgcc/32/_floatdixf.o
libgcc/32/_fixunsxfsi.o libgcc/32/_fixtfdi.o libgcc/32/_fixunstfdi.o
libgcc/32/_floatditf.o libgcc/32/_clear_cache.o
libgcc/32/_enable_execute_stack.o libgcc/32/_trampoline.o
libgcc/32/__main.o libgcc/32/_absvsi2.o libgcc/32/_absvdi2.o
libgcc/32/_addvsi3.o libgcc/32/_addvdi3.o libgcc/32/_subvsi3.o
libgcc/32/_subvdi3.o libgcc/32/_mulvsi3.o libgcc/32/_mulvdi3.o
libgcc/32/_negvsi2.o libgcc/32/_negvdi2.o libgcc/32/_ctors.o
libgcc/32/_ffssi2.o libgcc/32/_ffsdi2.o libgcc/32/_clz.o
libgcc/32/_clzsi2.o libgcc/32/_clzdi2.o libgcc/32/_ctzsi2.o
libgcc/32/_ctzdi2.o libgcc/32/_popcount_tab.o libgcc/32/_popcountsi2.o
libgcc/32/_popcountdi2.o libgcc/32/_paritysi2.o libgcc/32/_paritydi2.o
libgcc/32/_stack_smash_handler.o libgcc/32/_divdi3.o libgcc/32/_moddi3.o
libgcc/32/_udivdi3.o libgcc/32/_umoddi3.o libgcc/32/_udiv_w_sdiv.o
libgcc/32/_udivmoddi4.o  libgcc/32/unwind-dw2.o
libgcc/32/unwind-dw2-fde-glibc.o libgcc/32/unwind-sjlj.o
libgcc/32/gthr-gnat.o libgcc/32/unwind-c.o -lc && rm -f libgcc_s_32.so
&& if [ -f 32/libgcc_s.so.1 ]; then mv -f 32/libgcc_s.so.1
32/libgcc_s.so.1.backup; else true; fi && mv 32/libgcc_s.so.1.tmp
32/libgcc_s.so.1 && ln -s 32/libgcc_s.so.1 libgcc_s_32.so 
/usr/x86_64-pc-linux-gnu/bin/ld: skipping incompatible
/usr/lib/gcc/x86_64-pc-linux-gnu/3.4.4/../../../libc.so when searching
for -lc 
/usr/x86_64-pc-linux-gnu/bin/ld: skipping incompatible
/usr/lib/gcc/x86_64-pc-linux-gnu/3.4.4/../../../libc.a when searching
for -lc 
/usr/x86_64-pc-linux-gnu/bin/ld: skipping incompatible /usr/lib/libc.so
when searching for -lc 
/usr/x86_64-pc-linux-gnu/bin/ld: skipping incompatible /usr/lib/libc.a
when searching for -lc 
/usr/x86_64-pc-linux-gnu/bin/ld: cannot find -lc 
collect2: ld returned 1 exit status 
make[3]: *** [32/libgcc_s_32.so] Error 1 
make[3]: Leaving directory
`/var/tmp/portage/gcc-3.4.4-r1/work/build/gcc' 
make[2]: *** [stmp-multilib] Error 2 
make[2]: Leaving directory
`/var/tmp/portage/gcc-3.4.4-r1/work/build/gcc' 
make[1]: *** [stage1_build] Error 2 
make[1]: Leaving directory
`/var/tmp/portage/gcc-3.4.4-r1/work/build/gcc' 
make: *** [profiledbootstrap] Error 2 

!!! ERROR: sys-devel/gcc-3.4.4-r1 failed. 
!!! Function gcc_do_make, Line 1315, Exitcode 2 
!!! emake failed with profiledbootstrap 
!!! If you need support, post the topmost build error, NOT this status
message. 
	

Here is my emerge --info 

Code:	

Portage 2.0.51.22-r3 (default-linux/amd64/2005.1, gcc-3.4.4,
glibc-2.3.5-r2, 2.6.12-gentoo-r10 x86_64) 
================================================================= 
System uname: 2.6.12-gentoo-r10 x86_64 Intel(R) Xeon(TM) CPU 3.60GHz 
Gentoo Base System version 1.6.13 
dev-lang/python:     2.3.5-r2, 2.4.2 
sys-apps/sandbox:    1.2.12 
sys-devel/autoconf:  2.13, 2.59-r6 
sys-devel/automake:  1.4_p6, 1.5, 1.6.3, 1.7.9-r1, 1.8.5-r3, 1.9.6-r1 
sys-devel/binutils:  2.16.1 
sys-devel/libtool:   1.5.20 
virtual/os-headers:  2.6.11-r2 
ACCEPT_KEYWORDS="amd64" 
AUTOCLEAN="yes" 
CBUILD="x86_64-pc-linux-gnu" 
CFLAGS="-O2 -march=nocona -pipe" 
CHOST="x86_64-pc-linux-gnu" 
CONFIG_PROTECT="/etc /usr/kde/2/share/config /usr/kde/3/share/config
/usr/share/config /var/qmail/control" 
CONFIG_PROTECT_MASK="/etc/gconf /etc/terminfo /etc/env.d" 
CXXFLAGS="-O2 -march=nocona -pipe" 
DISTDIR="/usr/portage/distfiles" 
FEATURES="autoconfig distlocks sandbox sfperms strict" 
GENTOO_MIRRORS="http://distfiles.gentoo.org
http://distro.ibiblio.org/pub/Linux/distributions/gentoo" 
MAKEOPTS="-j2" 
PKGDIR="/usr/portage/packages" 
PORTAGE_TMPDIR="/var/tmp" 
PORTDIR="/usr/portage" 
SYNC="rsync://rsync.gentoo.org/gentoo-portage" 
USE="amd64 X alsa avi berkdb bitmap-fonts bzip2 crypt cups eds emboss
encode expat foomaticdb fortran gif gnome gpm gstreamer gtk gtk2 imlib
ipv6 jpeg kde lzw lzw-tiff mp3 mpeg ncurses nls opengl pam pdflib perl
png python qt quicktime readline sdl spell ssl tcpd tiff truetype-fonts
type1-fonts udev usb userlocales xpm xv zlib userland_GNU kernel_linux
elibc_glibc" 
Unset:  ASFLAGS, CTARGET, LANG, LC_ALL, LDFLAGS, LINGUAS,
PORTDIR_OVERLAY 
	


How can I solve this problem?

Replies

Subject Author
Re: [gentoo-amd64] gcc compile failed after 2005.1-r1 instalation Sebastian Redl <sebastian.redl@×××××××××××.at>
[gentoo-amd64] Re: gcc compile failed after 2005.1-r1 instalation Duncan <1i5t5.duncan@×××.net>