Gentoo Logo
Gentoo Spaceship




Note: Due to technical difficulties, the Archives are currently not up to date. GMANE provides an alternative service for most mailing lists.
c.f. bug 424647
List Archive: gentoo-ppc-dev
Navigation:
Lists: gentoo-ppc-dev: < Prev By Thread Next > < Prev By Date Next >
Headers:
To: gentoo-ppc-dev@g.o
From: Alexander Klosch <linux-lists@...>
Subject: kernel 2.6, alsa-libs 1.0.1, jack-audio-connection-kit 0.94.0, ardour :(
Date: Fri, 23 Jan 2004 17:31:34 +0100
hi all,

i just wanna tell that the combination of the three above compiles and
runs smoothly on ibook 2.2.
I just have problems compiling ardour:

/ardour-0.9_beta9/work/ardour-0.9beta9/libs/
-I/var/tmp/portage/ardour-0.9_beta9/work/ardour-0.9beta9/libs/gtk-canvas
-I/var/tmp/portage/ardour-0.9_beta9/work/ardour-0.9beta9/libs/gtk-canva
s/gtk-canvas
-I/var/tmp/portage/ardour-0.9_beta9/work/ardour-0.9beta9/libs/gtkmmext
-I/var/tmp/portage/ardour-0.9_beta9/work/ardour-0.9beta9/libs/gtkmm/gdk
--
-I/var/tmp/portage/ardour-0.9_beta9/work/ardour-0.9beta9/libs/gtkmm/src
-I/var/tmp/portage/ardour-0.9_beta9/work/ardour-0.9beta9/libs/gtkmm -c
-o colorselection.o `test -f 'colorselection.cc' || echo
'./'`colorselection.cc clist.cc: In member function `void
   Gtk::CList_Helpers::Cell::set_text(Gtk::nstring)':
clist.cc:385: Internal compiler error in verify_local_live_at_start, at
flow.c:
   586
Please submit a full bug report,
with preprocessed source if appropriate.
See <URL:http://bugs.gentoo.org/> for instructions.
make[6]: *** [clist.o] Error 1
make[6]: *** Waiting for unfinished jobs....
make[6]: Leaving directory
`/var/tmp/portage/ardour-0.9_beta9/work/ardour-0.9beta9/libs/gtkmm/src/
gtk--' make[5]: *** [all-recursive] Error 1
make[5]: Leaving directory
`/var/tmp/portage/ardour-0.9_beta9/work/ardour-0.9beta9/libs/gtkmm/src/
gtk--' make[4]: *** [all-recursive] Error 1
make[4]: Leaving directory
`/var/tmp/portage/ardour-0.9_beta9/work/ardour-0.9beta9/libs/gtkmm/src'
make[3]: *** [all-recursive] Error 1 make[3]: Leaving directory
`/var/tmp/portage/ardour-0.9_beta9/work/ardour-0.9beta9/libs/gtkmm'
make[2]: *** [all] Error 2 make[2]: Leaving directory
`/var/tmp/portage/ardour-0.9_beta9/work/ardour-0.9beta9/libs/gtkmm'
make[1]: *** [all-recursive] Error 1 make[1]: Leaving directory
`/var/tmp/portage/ardour-0.9_beta9/work/ardour-0.9beta9/libs' make: ***
[all-recursive] Error 1

!!! ERROR: media-sound/ardour-0.9_beta9 failed.
!!! Function src_compile, Line 40, Exitcode 2
!!! parallel make failed

does anyone know how to solve this?

regards,
kloschi

--
gentoo-ppc-dev@g.o mailing list

Navigation:
Lists: gentoo-ppc-dev: < Prev By Thread Next > < Prev By Date Next >
Previous by thread:
Report: Working ppc builds
Next by thread:
Successful merge of masked ebuild: app-office/koffice-1.3
Previous by date:
Re: Wallstreet XF86Config
Next by date:
Successful merge of masked ebuild: app-office/koffice-1.3


Updated Jun 17, 2009

Summary: Archive of the gentoo-ppc-dev mailing list.

Donate to support our development efforts.

Copyright 2001-2013 Gentoo Foundation, Inc. Questions, Comments? Contact us.