Gentoo Archives: gentoo-user-es

From: "Jesús González" <jesusglezalv@×××××.es>
To: gentoo-user-es@g.o
Subject: [gentoo-user-es] Problemas al compilar las X's
Date: Fri, 02 Aug 2002 11:58:34
Message-Id: 1028307510.24810.3.camel@spiderman
He conseguido instalar Gentoo (no sin sufrimiento), y cuando me disponía
a disfrutar de el usanda X's, me petan al instalar. El error es:

make[3]: Cambiando a directorio
`/var/tmp/portage/xfree-4.2.0-r12/work/xc/lib/Xf                   t'
flex -l  xftlex.l
sed 's/yy/XftConfig/g' lex.yy.c | sed 's/__REALLY_YY__/yy/' > xftlex.c
&& rm -f                    lex.yy.c
bison -y -d xftgram.y
xftgram.y:168: warning: previous rule lacks an ending `;'
make[3]: *** [xftgram.c] Violación de segmento
make[3]: Saliendo directorio
`/var/tmp/portage/xfree-4.2.0-r12/work/xc/lib/Xft'
make[2]: *** [depend] Error 2
make[2]: Saliendo directorio
`/var/tmp/portage/xfree-4.2.0-r12/work/xc/lib'
make[1]: *** [depend] Error 2
make[1]: Saliendo directorio `/var/tmp/portage/xfree-4.2.0-r12/work/xc'
make: *** [World] Error 2

!!! ERROR: The ebuild did not complete successfully.
!!! Function src_compile, Line 13, Exitcode 2
!!! (no error message)

!!! emerge aborting on 
/usr/portage/x11-base/xfree/xfree-4.2.0-r12.ebuild .



Por si tiene algo que ver, que no creo, estaba compilando desde otra
distro mediante chroot.

¿Es un bug?¿Es mi PC?

Un saludo, y gracias.

Replies

Subject Author
Re: [gentoo-user-es] Problemas al compilar las X's "Toni Cerdà" <antonicb@×××××××××.es>