Gentoo Archives: gentoo-user-es

From: enibal <enibal@×××××.es>
To: gentoo-list <gentoo-user-es@g.o>
Subject: Re: [gentoo-user-es] paquete teTex
Date: Mon, 26 Aug 2002 18:36:24
Message-Id: 1030405182.14409.27.camel@golgotha.darkvoid
In Reply to: Re: [gentoo-user-es] paquete teTex by Jose Alberto Suarez
El mar, 27-08-2002 a las 03:22, Jose Alberto Suarez escribió:
> ese es un error generico de q no ha finalizado el emerge, postea el error > real, usea el de la compilacion de latex. Aún mejor mira primero en los foros > y en bugs.gentoo.org y si no lo encuentras habre un bug nuevo :)
Mientras que busco el posible bug en la página (eso ya será mañana) copio el error en cuestión. gcc -o splitup splitup.o ../lib/lib.a ../../kpathsea/STATIC/libkpathsea.a -lm make[3]: Saliendo directorio `/var/tmp/portage/tetex-1.0.7-r10/work/teTeX-1.0/texk/web2c/web2c' cd web2c && make -w CC='gcc' CFLAGS='-march=i686 -O3 -pipe ' web2c make[3]: Cambiando a directorio `/var/tmp/portage/tetex-1.0.7-r10/work/teTeX-1.0/texk/web2c/web2c' Expect one shift/reduce conflict. bison -y -d -v ./web2c.y ./web2c.y:139: warning: previous rule lacks an ending `;' make[3]: *** [y_tab.h] Violación de segmento make[3]: Saliendo directorio `/var/tmp/portage/tetex-1.0.7-r10/work/teTeX-1.0/texk/web2c/web2c' make[2]: *** [web2c/web2c] Error 2 make[2]: Saliendo directorio `/var/tmp/portage/tetex-1.0.7-r10/work/teTeX-1.0/texk/web2c' make[1]: *** [all] Error 1 make[1]: Saliendo directorio `/var/tmp/portage/tetex-1.0.7-r10/work/teTeX-1.0/texk' make: *** [all] Error 1

Replies

Subject Author
Re: [gentoo-user-es] paquete teTex "Toni Cerdà" <antonicb@×××××××××.es>