Gentoo Archives: gentoo-user-fr

From: Didier Link <didier@××××××××××××.fr>
To: alim.dendane@××××××.lu, gentoo-user-fr@l.g.o
Subject: [gentoo-user-fr] Re: [AMD64] sandbox
Date: Fri, 18 Jan 2008 09:57:19
Message-Id: 20080118105712.3223a5f9@neutrino.cosmos.net
-----BEGIN PGP SIGNED MESSAGE-----
Hash: SHA1

Le Thu, 17 Jan 2008 23:45:08 -0800,
alim.dendane@××××××.lu a écrit :

> bonjour
Bonjour Alim, ne pas oublier de répondre sur la liste pour que tout le monde puisse profiter de la réponse ! ;)
> > j'ai exactement le même genre de souci car je narrive plus à compiler > portage et sandbox (plus d'autres packages). voici le genre de > message que je recois quand je compile sandbox : > > ############# > CHOST="x86_64-pc-linux-gnu" > ACCEPT_KEYWORDS="~amd64" > ############# > > gcc -DHAVE_CONFIG_H -I. -I../../sandbox-1.2.20alpha2/libsandbox -I.. > -I../../sandbox-1.2.20alpha2/libsbutil > -I../../sandbox-1.2.20alpha2/libsbutil/include -DETCDIR=\"/etc\" > -DLIBSANDBOX_PATH=\"/usr/lib32\" > -DSANDBOX_BASHRC_PATH=\"/usr/share/sandbox\" -DPIC -fPIC -D_REENTRANT > -I../../sandbox-1.2.20alpha2 -Wall -fexceptions -O2 -march=x86-64 > -pipe -MT libsandbox_la-wrappers.lo -MD -MP > -MF .deps/libsandbox_la-wrappers.Tpo > -c ../../sandbox-1.2.20alpha2/libsandbox/wrappers.c -fPIC -DPIC > -o .libs/libsandbox_la-wrappers.o ../../sandbox-1.2.20alpha2/libsandbox/wrappers.c: > In function > 'libsb_open': ../../sandbox-1.2.20alpha2/libsandbox/wrappers.c:673: > error: 'true_open_DEFAULT' undeclared (first use in this > function) ../../sandbox-1.2.20alpha2/libsandbox/wrappers.c:673: > error: (Each undeclared identifier is reported only > once ../../sandbox-1.2.20alpha2/libsandbox/wrappers.c:673: error: for > each function it appears > in.) ../../sandbox-1.2.20alpha2/libsandbox/wrappers.c:673: error: > 'symname_open_DEFAULT' undeclared (first use in this > function) ../../sandbox-1.2.20alpha2/libsandbox/wrappers.c:673: > error: 'symver_open_DEFAULT' undeclared (first use in this > function) ../../sandbox-1.2.20alpha2/libsandbox/wrappers.c:675: > warning: implicit declaration of function > 'true_open_DEFAULT' ../../sandbox-1.2.20alpha2/libsandbox/wrappers.c: > In function > 'libsb_getcwd': ../../sandbox-1.2.20alpha2/libsandbox/wrappers.c:684: > error: 'true_getcwd_DEFAULT' undeclared (first use in this > function) ../../sandbox-1.2.20alpha2/libsandbox/wrappers.c:684: > error: 'symname_getcwd_DEFAULT' undeclared (first use in this > function) ../../sandbox-1.2.20alpha2/libsandbox/wrappers.c:684: > error: 'symver_getcwd_DEFAULT' undeclared (first use in this > function) ../../sandbox-1.2.20alpha2/libsandbox/wrappers.c:686: > warning: implicit declaration of function > 'true_getcwd_DEFAULT' ../../sandbox-1.2.20alpha2/libsandbox/wrappers.c:686: > warning: return makes pointer from integer without a cast make[2]: > *** [libsandbox_la-wrappers.lo] Erreur 1 make[2]: *** Attente des > tâches non terminées.... make[1]: *** [all-recursive] Erreur 1 make: > *** [all] Erreur 2 > > * Building failed for ABI=x86!. This usually means a broken > * multilib setup. Please fix that before filling a bugreport > * against sandbox. > > * > * ERROR: sys-apps/sandbox-1.2.20_alpha2-r1 failed.
Tu essaies de compiler une version alpha, je pense que l'erreur viens de là ! Quels autres package sont unmasquer chez toi ? Tes erreurs de compilations viennent certainement de là ! Essaie de mettre la version la dernière version non masquée avec : emerge -1 =sys-apps/sandbox-1.2.18.1-r1 ça devrait compiler j'espère ! A+ et bon courage Didier - -- Didier Link <didier@××××××××××××.fr> Jabber : didier_link@××××××.fr MSN : zanfib@×××××××.fr SIP : Zanfib@×××××.net Clé GPG : 75BAC9EE -----BEGIN PGP SIGNATURE----- Version: GnuPG v2.0.7 (GNU/Linux) iD8DBQFHkHf7kyPwinW6ye4RAoNBAJ9RLd+Y1mOGMBjbdJw8o4ZW1tMjLgCfW097 Ztjf6b0IwOmVYtKJQw00+60= =lAHF -----END PGP SIGNATURE-----