Gentoo Archives: gentoo-releng-autobuilds

From: catalyst@×××××××××××××××××.org
To: releng@g.o, gentoo-releng-autobuilds@l.g.o
Subject: [gentoo-releng-autobuilds] [x86-auto] Catalyst non-fatal build error - installcd-stage2-minimal.spec
Date: Tue, 20 Oct 2015 06:28:20
Message-Id: 20151020062750.917B125DA5@nightheron.gentoo.org
*make -f scripts/Makefile.build obj=procps
*  gcc -Wp,-MD,networking/udhcp/.dhcpc.o.d   -std=gnu99 -Iinclude -Ilibbb  -include include/autoconf.h -D_GNU_SOURCE -DNDEBUG -D_LARGEFILE_SOURCE -D_LARGEFILE64_SOURCE -D_FILE_OFFSET_BITS=64 -D"BB_VER=KBUILD_STR(1.20.2)" -DBB_BT=AUTOCONF_TIMESTAMP  -Wall -Wshadow -Wwrite-strings -Wundef -Wstrict-prototypes -Wunused -Wunused-parameter -Wunused-function -Wunused-value -Wmissing-prototypes -Wmissing-declarations -Wdeclaration-after-statement -Wold-style-definition -fno-builtin-strlen -finline-limit=0 -fomit-frame-pointer -ffunction-sections -fdata-sections -fno-guess-branch-probability -funsigned-char -static-libgcc -falign-functions=1 -falign-jumps=1 -falign-labels=1 -falign-loops=1 -Os  -march=i386 -mpreferred-stack-boundary=2    -D"KBUILD_STR(s)=#s" -D"KBUILD_BASENAME=KBUILD_STR(dhcpc)"  -D"KBUILD_MODNAME=KBUILD_STR(dhcpc)" -c -o networking/udhcp/dhcpc.o networking/udhcp/dhcpc.c
*   rm -f procps/built-in.o; ar rcs procps/built-in.o
*  gcc -Wp,-MD,procps/.free.o.d   -std=gnu99 -Iinclude -Ilibbb  -include include/autoconf.h -D_GNU_SOURCE -DNDEBUG -D_LARGEFILE_SOURCE -D_LARGEFILE64_SOURCE -D_FILE_OFFSET_BITS=64 -D"BB_VER=KBUILD_STR(1.20.2)" -DBB_BT=AUTOCONF_TIMESTAMP  -Wall -Wshadow -Wwrite-strings -Wundef -Wstrict-prototypes -Wunused -Wunused-parameter -Wunused-function -Wunused-value -Wmissing-prototypes -Wmissing-declarations -Wdeclaration-after-statement -Wold-style-definition -fno-builtin-strlen -finline-limit=0 -fomit-frame-pointer -ffunction-sections -fdata-sections -fno-guess-branch-probability -funsigned-char -static-libgcc -falign-functions=1 -falign-jumps=1 -falign-labels=1 -falign-loops=1 -Os  -march=i386 -mpreferred-stack-boundary=2    -D"KBUILD_STR(s)=#s" -D"KBUILD_BASENAME=KBUILD_STR(free)"  -D"KBUILD_MODNAME=KBUILD_STR(free)" -c -o procps/free.o procps/free.c
*miscutils/man.c: In function 'run_pipe':
*miscutils/man.c:112:2: warning: ignoring return value of 'system', declared with attribute warn_unused_result [-Wunused-result]
*--
*  gcc -Wp,-MD,miscutils/.microcom.o.d   -std=gnu99 -Iinclude -Ilibbb  -include include/autoconf.h -D_GNU_SOURCE -DNDEBUG -D_LARGEFILE_SOURCE -D_LARGEFILE64_SOURCE -D_FILE_OFFSET_BITS=64 -D"BB_VER=KBUILD_STR(1.20.2)" -DBB_BT=AUTOCONF_TIMESTAMP  -Wall -Wshadow -Wwrite-strings -Wundef -Wstrict-prototypes -Wunused -Wunused-parameter -Wunused-function -Wunused-value -Wmissing-prototypes -Wmissing-declarations -Wdeclaration-after-statement -Wold-style-definition -fno-builtin-strlen -finline-limit=0 -fomit-frame-pointer -ffunction-sections -fdata-sections -fno-guess-branch-probability -funsigned-char -static-libgcc -falign-functions=1 -falign-jumps=1 -falign-labels=1 -falign-loops=1 -Os  -march=i386 -mpreferred-stack-boundary=2    -D"KBUILD_STR(s)=#s" -D"KBUILD_BASENAME=KBUILD_STR(microcom)"  -D"KBUILD_MODNAME=KBUILD_STR(microcom)" -c -o miscutils/microcom.o miscutils/microcom.c
*  gcc -Wp,-MD,modutils/.rmmod.o.d   -std=gnu99 -Iinclude -Ilibbb  -include include/autoconf.h -D_GNU_SOURCE -DNDEBUG -D_LARGEFILE_SOURCE -D_LARGEFILE64_SOURCE -D_FILE_OFFSET_BITS=64 -D"BB_VER=KBUILD_STR(1.20.2)" -DBB_BT=AUTOCONF_TIMESTAMP  -Wall -Wshadow -Wwrite-strings -Wundef -Wstrict-prototypes -Wunused -Wunused-parameter -Wunused-function -Wunused-value -Wmissing-prototypes -Wmissing-declarations -Wdeclaration-after-statement -Wold-style-definition -fno-builtin-strlen -finline-limit=0 -fomit-frame-pointer -ffunction-sections -fdata-sections -fno-guess-branch-probability -funsigned-char -static-libgcc -falign-functions=1 -falign-jumps=1 -falign-labels=1 -falign-loops=1 -Os  -march=i386 -mpreferred-stack-boundary=2    -D"KBUILD_STR(s)=#s" -D"KBUILD_BASENAME=KBUILD_STR(rmmod)"  -D"KBUILD_MODNAME=KBUILD_STR(rmmod)" -c -o modutils/rmmod.o modutils/rmmod.c
*  gcc -Wp,-MD,procps/.iostat.o.d   -std=gnu99 -Iinclude -Ilibbb  -include include/autoconf.h -D_GNU_SOURCE -DNDEBUG -D_LARGEFILE_SOURCE -D_LARGEFILE64_SOURCE -D_FILE_OFFSET_BITS=64 -D"BB_VER=KBUILD_STR(1.20.2)" -DBB_BT=AUTOCONF_TIMESTAMP  -Wall -Wshadow -Wwrite-strings -Wundef -Wstrict-prototypes -Wunused -Wunused-parameter -Wunused-function -Wunused-value -Wmissing-prototypes -Wmissing-declarations -Wdeclaration-after-statement -Wold-style-definition -fno-builtin-strlen -finline-limit=0 -fomit-frame-pointer -ffunction-sections -fdata-sections -fno-guess-branch-probability -funsigned-char -static-libgcc -falign-functions=1 -falign-jumps=1 -falign-labels=1 -falign-loops=1 -Os  -march=i386 -mpreferred-stack-boundary=2    -D"KBUILD_STR(s)=#s" -D"KBUILD_BASENAME=KBUILD_STR(iostat)"  -D"KBUILD_MODNAME=KBUILD_STR(iostat)" -c -o procps/iostat.o procps/iostat.c
*  gcc -Wp,-MD,coreutils/.mv.o.d   -std=gnu99 -Iinclude -Ilibbb  -include include/autoconf.h -D_GNU_SOURCE -DNDEBUG -D_LARGEFILE_SOURCE -D_LARGEFILE64_SOURCE -D_FILE_OFFSET_BITS=64 -D"BB_VER=KBUILD_STR(1.20.2)" -DBB_BT=AUTOCONF_TIMESTAMP  -Wall -Wshadow -Wwrite-strings -Wundef -Wstrict-prototypes -Wunused -Wunused-parameter -Wunused-function -Wunused-value -Wmissing-prototypes -Wmissing-declarations -Wdeclaration-after-statement -Wold-style-definition -fno-builtin-strlen -finline-limit=0 -fomit-frame-pointer -ffunction-sections -fdata-sections -fno-guess-branch-probability -funsigned-char -static-libgcc -falign-functions=1 -falign-jumps=1 -falign-labels=1 -falign-loops=1 -Os  -march=i386 -mpreferred-stack-boundary=2    -D"KBUILD_STR(s)=#s" -D"KBUILD_BASENAME=KBUILD_STR(mv)"  -D"KBUILD_MODNAME=KBUILD_STR(mv)" -c -o coreutils/mv.o coreutils/mv.c
*miscutils/microcom.c: In function 'microcom_main':
*miscutils/microcom.c:152:4: warning: ignoring return value of 'write', declared with attribute warn_unused_result [-Wunused-result]
*--
*  gcc -Wp,-MD,procps/.mpstat.o.d   -std=gnu99 -Iinclude -Ilibbb  -include include/autoconf.h -D_GNU_SOURCE -DNDEBUG -D_LARGEFILE_SOURCE -D_LARGEFILE64_SOURCE -D_FILE_OFFSET_BITS=64 -D"BB_VER=KBUILD_STR(1.20.2)" -DBB_BT=AUTOCONF_TIMESTAMP  -Wall -Wshadow -Wwrite-strings -Wundef -Wstrict-prototypes -Wunused -Wunused-parameter -Wunused-function -Wunused-value -Wmissing-prototypes -Wmissing-declarations -Wdeclaration-after-statement -Wold-style-definition -fno-builtin-strlen -finline-limit=0 -fomit-frame-pointer -ffunction-sections -fdata-sections -fno-guess-branch-probability -funsigned-char -static-libgcc -falign-functions=1 -falign-jumps=1 -falign-labels=1 -falign-loops=1 -Os  -march=i386 -mpreferred-stack-boundary=2    -D"KBUILD_STR(s)=#s" -D"KBUILD_BASENAME=KBUILD_STR(mpstat)"  -D"KBUILD_MODNAME=KBUILD_STR(mpstat)" -c -o procps/mpstat.o procps/mpstat.c
*  gcc -Wp,-MD,libbb/.fclose_nonstdin.o.d   -std=gnu99 -Iinclude -Ilibbb  -include include/autoconf.h -D_GNU_SOURCE -DNDEBUG -D_LARGEFILE_SOURCE -D_LARGEFILE64_SOURCE -D_FILE_OFFSET_BITS=64 -D"BB_VER=KBUILD_STR(1.20.2)" -DBB_BT=AUTOCONF_TIMESTAMP  -Wall -Wshadow -Wwrite-strings -Wundef -Wstrict-prototypes -Wunused -Wunused-parameter -Wunused-function -Wunused-value -Wmissing-prototypes -Wmissing-declarations -Wdeclaration-after-statement -Wold-style-definition -fno-builtin-strlen -finline-limit=0 -fomit-frame-pointer -ffunction-sections -fdata-sections -fno-guess-branch-probability -funsigned-char -static-libgcc -falign-functions=1 -falign-jumps=1 -falign-labels=1 -falign-loops=1 -Os  -march=i386 -mpreferred-stack-boundary=2    -D"KBUILD_STR(s)=#s" -D"KBUILD_BASENAME=KBUILD_STR(fclose_nonstdin)"  -D"KBUILD_MODNAME=KBUILD_STR(fclose_nonstdin)" -c -o libbb/fclose_nonstdin.o libbb/fclose_nonstdin.c
*  gcc -Wp,-MD,miscutils/.ubi_tools.o.d   -std=gnu99 -Iinclude -Ilibbb  -include include/autoconf.h -D_GNU_SOURCE -DNDEBUG -D_LARGEFILE_SOURCE -D_LARGEFILE64_SOURCE -D_FILE_OFFSET_BITS=64 -D"BB_VER=KBUILD_STR(1.20.2)" -DBB_BT=AUTOCONF_TIMESTAMP  -Wall -Wshadow -Wwrite-strings -Wundef -Wstrict-prototypes -Wunused -Wunused-parameter -Wunused-function -Wunused-value -Wmissing-prototypes -Wmissing-declarations -Wdeclaration-after-statement -Wold-style-definition -fno-builtin-strlen -finline-limit=0 -fomit-frame-pointer -ffunction-sections -fdata-sections -fno-guess-branch-probability -funsigned-char -static-libgcc -falign-functions=1 -falign-jumps=1 -falign-labels=1 -falign-loops=1 -Os  -march=i386 -mpreferred-stack-boundary=2    -D"KBUILD_STR(s)=#s" -D"KBUILD_BASENAME=KBUILD_STR(ubi_tools)"  -D"KBUILD_MODNAME=KBUILD_STR(ubi_tools)" -c -o miscutils/ubi_tools.o miscutils/ubi_tools.c
*In file included from networking/interface.c:34:0:
*networking/interface.c: In function 'if_readlist_proc':
*include/libbb.h:171:30: warning: ignoring return value of 'fgets_unlocked', declared with attribute warn_unused_result [-Wunused-result]
* # define fgets(s, n, stream) fgets_unlocked(s, n, stream)
*                              ^
*networking/interface.c:572:2: note: in expansion of macro 'fgets'
*  fgets(buf, sizeof buf, fh); /* eat line */
*  ^
*include/libbb.h:171:30: warning: ignoring return value of 'fgets_unlocked', declared with attribute warn_unused_result [-Wunused-result]
*--
*  gcc -Wp,-MD,networking/.nbd-client.o.d   -std=gnu99 -Iinclude -Ilibbb  -include include/autoconf.h -D_GNU_SOURCE -DNDEBUG -D_LARGEFILE_SOURCE -D_LARGEFILE64_SOURCE -D_FILE_OFFSET_BITS=64 -D"BB_VER=KBUILD_STR(1.20.2)" -DBB_BT=AUTOCONF_TIMESTAMP  -Wall -Wshadow -Wwrite-strings -Wundef -Wstrict-prototypes -Wunused -Wunused-parameter -Wunused-function -Wunused-value -Wmissing-prototypes -Wmissing-declarations -Wdeclaration-after-statement -Wold-style-definition -fno-builtin-strlen -finline-limit=0 -fomit-frame-pointer -ffunction-sections -fdata-sections -fno-guess-branch-probability -funsigned-char -static-libgcc -falign-functions=1 -falign-jumps=1 -falign-labels=1 -falign-loops=1 -Os  -march=i386 -mpreferred-stack-boundary=2    -D"KBUILD_STR(s)=#s" -D"KBUILD_BASENAME=KBUILD_STR(nbd_client)"  -D"KBUILD_MODNAME=KBUILD_STR(nbd_client)" -c -o networking/nbd-client.o networking/nbd-client.c
*  rm -f miscutils/lib.a; ar  rcs miscutils/lib.a miscutils/beep.o miscutils/chat.o miscutils/devmem.o miscutils/fbsplash.o miscutils/ionice.o miscutils/makedevs.o miscutils/man.o miscutils/microcom.o miscutils/setserial.o miscutils/timeout.o miscutils/ubi_tools.o miscutils/volname.o
*  gcc -Wp,-MD,libbb/.find_mount_point.o.d   -std=gnu99 -Iinclude -Ilibbb  -include include/autoconf.h -D_GNU_SOURCE -DNDEBUG -D_LARGEFILE_SOURCE -D_LARGEFILE64_SOURCE -D_FILE_OFFSET_BITS=64 -D"BB_VER=KBUILD_STR(1.20.2)" -DBB_BT=AUTOCONF_TIMESTAMP  -Wall -Wshadow -Wwrite-strings -Wundef -Wstrict-prototypes -Wunused -Wunused-parameter -Wunused-function -Wunused-value -Wmissing-prototypes -Wmissing-declarations -Wdeclaration-after-statement -Wold-style-definition -fno-builtin-strlen -finline-limit=0 -fomit-frame-pointer -ffunction-sections -fdata-sections -fno-guess-branch-probability -funsigned-char -static-libgcc -falign-functions=1 -falign-jumps=1 -falign-labels=1 -falign-loops=1 -Os  -march=i386 -mpreferred-stack-boundary=2    -D"KBUILD_STR(s)=#s" -D"KBUILD_BASENAME=KBUILD_STR(find_mount_point)"  -D"KBUILD_MODNAME=KBUILD_STR(find_mount_point)" -c -o libbb/find_mount_point.o libbb/find_mount_point.c
*make -f scripts/Makefile.build obj=sysklogd
*shell/ash.c: In function 'evalcommand':
*shell/ash.c:9305:15: warning: variable 'oldpath' set but not used [-Wunused-but-set-variable]
*--
*   rm -f sysklogd/built-in.o; ar rcs sysklogd/built-in.o
*  gcc -Wp,-MD,procps/.pgrep.o.d   -std=gnu99 -Iinclude -Ilibbb  -include include/autoconf.h -D_GNU_SOURCE -DNDEBUG -D_LARGEFILE_SOURCE -D_LARGEFILE64_SOURCE -D_FILE_OFFSET_BITS=64 -D"BB_VER=KBUILD_STR(1.20.2)" -DBB_BT=AUTOCONF_TIMESTAMP  -Wall -Wshadow -Wwrite-strings -Wundef -Wstrict-prototypes -Wunused -Wunused-parameter -Wunused-function -Wunused-value -Wmissing-prototypes -Wmissing-declarations -Wdeclaration-after-statement -Wold-style-definition -fno-builtin-strlen -finline-limit=0 -fomit-frame-pointer -ffunction-sections -fdata-sections -fno-guess-branch-probability -funsigned-char -static-libgcc -falign-functions=1 -falign-jumps=1 -falign-labels=1 -falign-loops=1 -Os  -march=i386 -mpreferred-stack-boundary=2    -D"KBUILD_STR(s)=#s" -D"KBUILD_BASENAME=KBUILD_STR(pgrep)"  -D"KBUILD_MODNAME=KBUILD_STR(pgrep)" -c -o procps/pgrep.o procps/pgrep.c
*  rm -f sysklogd/lib.a; ar  rcs sysklogd/lib.a 
*make -f scripts/Makefile.build obj=util-linux
*networking/nbd-client.c: In function 'nbdclient_main':
*networking/nbd-client.c:133:4: warning: ignoring return value of 'daemon', declared with attribute warn_unused_result [-Wunused-result]
*--
*  gcc -Wp,-MD,libbb/.hash_md5_sha.o.d   -std=gnu99 -Iinclude -Ilibbb  -include include/autoconf.h -D_GNU_SOURCE -DNDEBUG -D_LARGEFILE_SOURCE -D_LARGEFILE64_SOURCE -D_FILE_OFFSET_BITS=64 -D"BB_VER=KBUILD_STR(1.20.2)" -DBB_BT=AUTOCONF_TIMESTAMP  -Wall -Wshadow -Wwrite-strings -Wundef -Wstrict-prototypes -Wunused -Wunused-parameter -Wunused-function -Wunused-value -Wmissing-prototypes -Wmissing-declarations -Wdeclaration-after-statement -Wold-style-definition -fno-builtin-strlen -finline-limit=0 -fomit-frame-pointer -ffunction-sections -fdata-sections -fno-guess-branch-probability -funsigned-char -static-libgcc -falign-functions=1 -falign-jumps=1 -falign-labels=1 -falign-loops=1 -Os  -march=i386 -mpreferred-stack-boundary=2    -D"KBUILD_STR(s)=#s" -D"KBUILD_BASENAME=KBUILD_STR(hash_md5_sha)"  -D"KBUILD_MODNAME=KBUILD_STR(hash_md5_sha)" -c -o libbb/hash_md5_sha.o libbb/hash_md5_sha.c
*  gcc -Wp,-MD,coreutils/.uniq.o.d   -std=gnu99 -Iinclude -Ilibbb  -include include/autoconf.h -D_GNU_SOURCE -DNDEBUG -D_LARGEFILE_SOURCE -D_LARGEFILE64_SOURCE -D_FILE_OFFSET_BITS=64 -D"BB_VER=KBUILD_STR(1.20.2)" -DBB_BT=AUTOCONF_TIMESTAMP  -Wall -Wshadow -Wwrite-strings -Wundef -Wstrict-prototypes -Wunused -Wunused-parameter -Wunused-function -Wunused-value -Wmissing-prototypes -Wmissing-declarations -Wdeclaration-after-statement -Wold-style-definition -fno-builtin-strlen -finline-limit=0 -fomit-frame-pointer -ffunction-sections -fdata-sections -fno-guess-branch-probability -funsigned-char -static-libgcc -falign-functions=1 -falign-jumps=1 -falign-labels=1 -falign-loops=1 -Os  -march=i386 -mpreferred-stack-boundary=2    -D"KBUILD_STR(s)=#s" -D"KBUILD_BASENAME=KBUILD_STR(uniq)"  -D"KBUILD_MODNAME=KBUILD_STR(uniq)" -c -o coreutils/uniq.o coreutils/uniq.c
*  gcc -Wp,-MD,util-linux/.lsusb.o.d   -std=gnu99 -Iinclude -Ilibbb  -include include/autoconf.h -D_GNU_SOURCE -DNDEBUG -D_LARGEFILE_SOURCE -D_LARGEFILE64_SOURCE -D_FILE_OFFSET_BITS=64 -D"BB_VER=KBUILD_STR(1.20.2)" -DBB_BT=AUTOCONF_TIMESTAMP  -Wall -Wshadow -Wwrite-strings -Wundef -Wstrict-prototypes -Wunused -Wunused-parameter -Wunused-function -Wunused-value -Wmissing-prototypes -Wmissing-declarations -Wdeclaration-after-statement -Wold-style-definition -fno-builtin-strlen -finline-limit=0 -fomit-frame-pointer -ffunction-sections -fdata-sections -fno-guess-branch-probability -funsigned-char -static-libgcc -falign-functions=1 -falign-jumps=1 -falign-labels=1 -falign-loops=1 -Os  -march=i386 -mpreferred-stack-boundary=2    -D"KBUILD_STR(s)=#s" -D"KBUILD_BASENAME=KBUILD_STR(lsusb)"  -D"KBUILD_MODNAME=KBUILD_STR(lsusb)" -c -o util-linux/lsusb.o util-linux/lsusb.c
*  gcc -Wp,-MD,util-linux/volume_id/.ocfs2.o.d   -std=gnu99 -Iinclude -Ilibbb  -include include/autoconf.h -D_GNU_SOURCE -DNDEBUG -D_LARGEFILE_SOURCE -D_LARGEFILE64_SOURCE -D_FILE_OFFSET_BITS=64 -D"BB_VER=KBUILD_STR(1.20.2)" -DBB_BT=AUTOCONF_TIMESTAMP  -Wall -Wshadow -Wwrite-strings -Wundef -Wstrict-prototypes -Wunused -Wunused-parameter -Wunused-function -Wunused-value -Wmissing-prototypes -Wmissing-declarations -Wdeclaration-after-statement -Wold-style-definition -fno-builtin-strlen -finline-limit=0 -fomit-frame-pointer -ffunction-sections -fdata-sections -fno-guess-branch-probability -funsigned-char -static-libgcc -falign-functions=1 -falign-jumps=1 -falign-labels=1 -falign-loops=1 -Os  -march=i386 -mpreferred-stack-boundary=2    -D"KBUILD_STR(s)=#s" -D"KBUILD_BASENAME=KBUILD_STR(ocfs2)"  -D"KBUILD_MODNAME=KBUILD_STR(ocfs2)" -c -o util-linux/volume_id/ocfs2.o util-linux/volume_id/ocfs2.c
*libbb/hash_md5_sha.c: In function 'common64_end':
*libbb/hash_md5_sha.c:82:4: warning: dereferencing type-punned pointer will break strict-aliasing rules [-Wstrict-aliasing]
*    *(uint64_t *) (&ctx->wbuffer[64 - 8]) = t;
*    ^
*  rm -f networking/lib.a; ar  rcs networking/lib.a networking/brctl.o networking/ftpd.o networking/hostname.o networking/ifconfig.o networking/ifenslave.o networking/ifplugd.o networking/interface.o networking/nbd-client.o networking/ntpd.o networking/ping.o networking/route.o networking/tftp.o networking/tunctl.o networking/wget.o networking/whois.o
*libbb/hash_md5_sha.c: In function 'sha512_end':
*libbb/hash_md5_sha.c:881:4: warning: dereferencing type-punned pointer will break strict-aliasing rules [-Wstrict-aliasing]
*    *(uint64_t *) (&ctx->wbuffer[128 - 8]) = t;
*    ^
*libbb/hash_md5_sha.c:884:4: warning: dereferencing type-punned pointer will break strict-aliasing rules [-Wstrict-aliasing]
*--
*  gcc -Wp,-MD,shell/.math.o.d   -std=gnu99 -Iinclude -Ilibbb  -include include/autoconf.h -D_GNU_SOURCE -DNDEBUG -D_LARGEFILE_SOURCE -D_LARGEFILE64_SOURCE -D_FILE_OFFSET_BITS=64 -D"BB_VER=KBUILD_STR(1.20.2)" -DBB_BT=AUTOCONF_TIMESTAMP  -Wall -Wshadow -Wwrite-strings -Wundef -Wstrict-prototypes -Wunused -Wunused-parameter -Wunused-function -Wunused-value -Wmissing-prototypes -Wmissing-declarations -Wdeclaration-after-statement -Wold-style-definition -fno-builtin-strlen -finline-limit=0 -fomit-frame-pointer -ffunction-sections -fdata-sections -fno-guess-branch-probability -funsigned-char -static-libgcc -falign-functions=1 -falign-jumps=1 -falign-labels=1 -falign-loops=1 -Os  -march=i386 -mpreferred-stack-boundary=2    -D"KBUILD_STR(s)=#s" -D"KBUILD_BASENAME=KBUILD_STR(math)"  -D"KBUILD_MODNAME=KBUILD_STR(math)" -c -o shell/math.o shell/math.c
*  gcc -Wp,-MD,coreutils/.uudecode.o.d   -std=gnu99 -Iinclude -Ilibbb  -include include/autoconf.h -D_GNU_SOURCE -DNDEBUG -D_LARGEFILE_SOURCE -D_LARGEFILE64_SOURCE -D_FILE_OFFSET_BITS=64 -D"BB_VER=KBUILD_STR(1.20.2)" -DBB_BT=AUTOCONF_TIMESTAMP  -Wall -Wshadow -Wwrite-strings -Wundef -Wstrict-prototypes -Wunused -Wunused-parameter -Wunused-function -Wunused-value -Wmissing-prototypes -Wmissing-declarations -Wdeclaration-after-statement -Wold-style-definition -fno-builtin-strlen -finline-limit=0 -fomit-frame-pointer -ffunction-sections -fdata-sections -fno-guess-branch-probability -funsigned-char -static-libgcc -falign-functions=1 -falign-jumps=1 -falign-labels=1 -falign-loops=1 -Os  -march=i386 -mpreferred-stack-boundary=2    -D"KBUILD_STR(s)=#s" -D"KBUILD_BASENAME=KBUILD_STR(uudecode)"  -D"KBUILD_MODNAME=KBUILD_STR(uudecode)" -c -o coreutils/uudecode.o coreutils/uudecode.c
*  gcc -Wp,-MD,shell/.shell_common.o.d   -std=gnu99 -Iinclude -Ilibbb  -include include/autoconf.h -D_GNU_SOURCE -DNDEBUG -D_LARGEFILE_SOURCE -D_LARGEFILE64_SOURCE -D_FILE_OFFSET_BITS=64 -D"BB_VER=KBUILD_STR(1.20.2)" -DBB_BT=AUTOCONF_TIMESTAMP  -Wall -Wshadow -Wwrite-strings -Wundef -Wstrict-prototypes -Wunused -Wunused-parameter -Wunused-function -Wunused-value -Wmissing-prototypes -Wmissing-declarations -Wdeclaration-after-statement -Wold-style-definition -fno-builtin-strlen -finline-limit=0 -fomit-frame-pointer -ffunction-sections -fdata-sections -fno-guess-branch-probability -funsigned-char -static-libgcc -falign-functions=1 -falign-jumps=1 -falign-labels=1 -falign-loops=1 -Os  -march=i386 -mpreferred-stack-boundary=2    -D"KBUILD_STR(s)=#s" -D"KBUILD_BASENAME=KBUILD_STR(shell_common)"  -D"KBUILD_MODNAME=KBUILD_STR(shell_common)" -c -o shell/shell_common.o shell/shell_common.c
*  gcc -Wp,-MD,util-linux/.mdStart.o.d   -std=gnu99 -Iinclude -Ilibbb  -include include/autoconf.h -D_GNU_SOURCE -DNDEBUG -D_LARGEFILE_SOURCE -D_LARGEFILE64_SOURCE -D_FILE_OFFSET_BITS=64 -D"BB_VER=KBUILD_STR(1.20.2)" -DBB_BT=AUTOCONF_TIMESTAMP  -Wall -Wshadow -Wwrite-strings -Wundef -Wstrict-prototypes -Wunused -Wunused-parameter -Wunused-function -Wunused-value -Wmissing-prototypes -Wmissing-declarations -Wdeclaration-after-statement -Wold-style-definition -fno-builtin-strlen -finline-limit=0 -fomit-frame-pointer -ffunction-sections -fdata-sections -fno-guess-branch-probability -funsigned-char -static-libgcc -falign-functions=1 -falign-jumps=1 -falign-labels=1 -falign-loops=1 -Os  -march=i386 -mpreferred-stack-boundary=2    -D"KBUILD_STR(s)=#s" -D"KBUILD_BASENAME=KBUILD_STR(mdStart)"  -D"KBUILD_MODNAME=KBUILD_STR(mdStart)" -c -o util-linux/mdStart.o util-linux/mdStart.c
*  gcc -Wp,-MD,libbb/.herror_msg.o.d   -std=gnu99 -Iinclude -Ilibbb  -include include/autoconf.h -D_GNU_SOURCE -DNDEBUG -D_LARGEFILE_SOURCE -D_LARGEFILE64_SOURCE -D_FILE_OFFSET_BITS=64 -D"BB_VER=KBUILD_STR(1.20.2)" -DBB_BT=AUTOCONF_TIMESTAMP  -Wall -Wshadow -Wwrite-strings -Wundef -Wstrict-prototypes -Wunused -Wunused-parameter -Wunused-function -Wunused-value -Wmissing-prototypes -Wmissing-declarations -Wdeclaration-after-statement -Wold-style-definition -fno-builtin-strlen -finline-limit=0 -fomit-frame-pointer -ffunction-sections -fdata-sections -fno-guess-branch-probability -funsigned-char -static-libgcc -falign-functions=1 -falign-jumps=1 -falign-labels=1 -falign-loops=1 -Os  -march=i386 -mpreferred-stack-boundary=2    -D"KBUILD_STR(s)=#s" -D"KBUILD_BASENAME=KBUILD_STR(herror_msg)"  -D"KBUILD_MODNAME=KBUILD_STR(herror_msg)" -c -o libbb/herror_msg.o libbb/herror_msg.c
*util-linux/mdStart.c:37:1: warning: no previous prototype for 'mdstart_main' [-Wmissing-prototypes]
* mdstart_main(int argc, char *argv[])
* ^
*util-linux/mdStart.c: In function 'mdstart_main':
*util-linux/mdStart.c:43:3: warning: implicit declaration of function 'bb_show_usage' [-Wimplicit-function-declaration]
*   bb_show_usage();
*   ^
*util-linux/mdStart.c:48:3: warning: implicit declaration of function 'sscanf' [-Wimplicit-function-declaration]
*   if(sscanf(argv[i], "%d", &part) == 1)
*   ^
*util-linux/mdStart.c:48:6: warning: incompatible implicit declaration of built-in function 'sscanf'
*   if(sscanf(argv[i], "%d", &part) == 1)
*      ^
*util-linux/mdStart.c:55:4: warning: implicit declaration of function 'close' [-Wimplicit-function-declaration]
*    close(fd);
*    ^
*util-linux/mdStart.c:58:4: warning: implicit declaration of function 'printf' [-Wimplicit-function-declaration]
*    printf("Error: Failed to open %s!
", argv[i]);
*    ^
*util-linux/mdStart.c:58:4: warning: incompatible implicit declaration of built-in function 'printf'
*--
*  gcc -Wp,-MD,util-linux/volume_id/.romfs.o.d   -std=gnu99 -Iinclude -Ilibbb  -include include/autoconf.h -D_GNU_SOURCE -DNDEBUG -D_LARGEFILE_SOURCE -D_LARGEFILE64_SOURCE -D_FILE_OFFSET_BITS=64 -D"BB_VER=KBUILD_STR(1.20.2)" -DBB_BT=AUTOCONF_TIMESTAMP  -Wall -Wshadow -Wwrite-strings -Wundef -Wstrict-prototypes -Wunused -Wunused-parameter -Wunused-function -Wunused-value -Wmissing-prototypes -Wmissing-declarations -Wdeclaration-after-statement -Wold-style-definition -fno-builtin-strlen -finline-limit=0 -fomit-frame-pointer -ffunction-sections -fdata-sections -fno-guess-branch-probability -funsigned-char -static-libgcc -falign-functions=1 -falign-jumps=1 -falign-labels=1 -falign-loops=1 -Os  -march=i386 -mpreferred-stack-boundary=2    -D"KBUILD_STR(s)=#s" -D"KBUILD_BASENAME=KBUILD_STR(romfs)"  -D"KBUILD_MODNAME=KBUILD_STR(romfs)" -c -o util-linux/volume_id/romfs.o util-linux/volume_id/romfs.c
*  gcc -Wp,-MD,util-linux/.mkfs_ext2.o.d   -std=gnu99 -Iinclude -Ilibbb  -include include/autoconf.h -D_GNU_SOURCE -DNDEBUG -D_LARGEFILE_SOURCE -D_LARGEFILE64_SOURCE -D_FILE_OFFSET_BITS=64 -D"BB_VER=KBUILD_STR(1.20.2)" -DBB_BT=AUTOCONF_TIMESTAMP  -Wall -Wshadow -Wwrite-strings -Wundef -Wstrict-prototypes -Wunused -Wunused-parameter -Wunused-function -Wunused-value -Wmissing-prototypes -Wmissing-declarations -Wdeclaration-after-statement -Wold-style-definition -fno-builtin-strlen -finline-limit=0 -fomit-frame-pointer -ffunction-sections -fdata-sections -fno-guess-branch-probability -funsigned-char -static-libgcc -falign-functions=1 -falign-jumps=1 -falign-labels=1 -falign-loops=1 -Os  -march=i386 -mpreferred-stack-boundary=2    -D"KBUILD_STR(s)=#s" -D"KBUILD_BASENAME=KBUILD_STR(mkfs_ext2)"  -D"KBUILD_MODNAME=KBUILD_STR(mkfs_ext2)" -c -o util-linux/mkfs_ext2.o util-linux/mkfs_ext2.c
*  gcc -Wp,-MD,libbb/.human_readable.o.d   -std=gnu99 -Iinclude -Ilibbb  -include include/autoconf.h -D_GNU_SOURCE -DNDEBUG -D_LARGEFILE_SOURCE -D_LARGEFILE64_SOURCE -D_FILE_OFFSET_BITS=64 -D"BB_VER=KBUILD_STR(1.20.2)" -DBB_BT=AUTOCONF_TIMESTAMP  -Wall -Wshadow -Wwrite-strings -Wundef -Wstrict-prototypes -Wunused -Wunused-parameter -Wunused-function -Wunused-value -Wmissing-prototypes -Wmissing-declarations -Wdeclaration-after-statement -Wold-style-definition -fno-builtin-strlen -finline-limit=0 -fomit-frame-pointer -ffunction-sections -fdata-sections -fno-guess-branch-probability -funsigned-char -static-libgcc -falign-functions=1 -falign-jumps=1 -falign-labels=1 -falign-loops=1 -Os  -march=i386 -mpreferred-stack-boundary=2    -D"KBUILD_STR(s)=#s" -D"KBUILD_BASENAME=KBUILD_STR(human_readable)"  -D"KBUILD_MODNAME=KBUILD_STR(human_readable)" -c -o libbb/human_readable.o libbb/human_readable.c
*  gcc -Wp,-MD,util-linux/volume_id/.sysv.o.d   -std=gnu99 -Iinclude -Ilibbb  -include include/autoconf.h -D_GNU_SOURCE -DNDEBUG -D_LARGEFILE_SOURCE -D_LARGEFILE64_SOURCE -D_FILE_OFFSET_BITS=64 -D"BB_VER=KBUILD_STR(1.20.2)" -DBB_BT=AUTOCONF_TIMESTAMP  -Wall -Wshadow -Wwrite-strings -Wundef -Wstrict-prototypes -Wunused -Wunused-parameter -Wunused-function -Wunused-value -Wmissing-prototypes -Wmissing-declarations -Wdeclaration-after-statement -Wold-style-definition -fno-builtin-strlen -finline-limit=0 -fomit-frame-pointer -ffunction-sections -fdata-sections -fno-guess-branch-probability -funsigned-char -static-libgcc -falign-functions=1 -falign-jumps=1 -falign-labels=1 -falign-loops=1 -Os  -march=i386 -mpreferred-stack-boundary=2    -D"KBUILD_STR(s)=#s" -D"KBUILD_BASENAME=KBUILD_STR(sysv)"  -D"KBUILD_MODNAME=KBUILD_STR(sysv)" -c -o util-linux/volume_id/sysv.o util-linux/volume_id/sysv.c
*util-linux/mdev.c: In function 'make_device':
*util-linux/mdev.c:564:5: warning: ignoring return value of 'symlink', declared with attribute warn_unused_result [-Wunused-result]
*     symlink(node_name, "root");
*     ^
*util-linux/mdev.c:567:5: warning: ignoring return value of 'chown', declared with attribute warn_unused_result [-Wunused-result]
*     chown(node_name, rule->ugid.uid, rule->ugid.gid);
*     ^
*util-linux/mdev.c:574:6: warning: ignoring return value of 'symlink', declared with attribute warn_unused_result [-Wunused-result]
*--
*  gcc -Wp,-MD,libbb/.update_passwd.o.d   -std=gnu99 -Iinclude -Ilibbb  -include include/autoconf.h -D_GNU_SOURCE -DNDEBUG -D_LARGEFILE_SOURCE -D_LARGEFILE64_SOURCE -D_FILE_OFFSET_BITS=64 -D"BB_VER=KBUILD_STR(1.20.2)" -DBB_BT=AUTOCONF_TIMESTAMP  -Wall -Wshadow -Wwrite-strings -Wundef -Wstrict-prototypes -Wunused -Wunused-parameter -Wunused-function -Wunused-value -Wmissing-prototypes -Wmissing-declarations -Wdeclaration-after-statement -Wold-style-definition -fno-builtin-strlen -finline-limit=0 -fomit-frame-pointer -ffunction-sections -fdata-sections -fno-guess-branch-probability -funsigned-char -static-libgcc -falign-functions=1 -falign-jumps=1 -falign-labels=1 -falign-loops=1 -Os  -march=i386 -mpreferred-stack-boundary=2    -D"KBUILD_STR(s)=#s" -D"KBUILD_BASENAME=KBUILD_STR(update_passwd)"  -D"KBUILD_MODNAME=KBUILD_STR(update_passwd)" -c -o libbb/update_passwd.o libbb/update_passwd.c
*  gcc -Wp,-MD,libbb/.uuencode.o.d   -std=gnu99 -Iinclude -Ilibbb  -include include/autoconf.h -D_GNU_SOURCE -DNDEBUG -D_LARGEFILE_SOURCE -D_LARGEFILE64_SOURCE -D_FILE_OFFSET_BITS=64 -D"BB_VER=KBUILD_STR(1.20.2)" -DBB_BT=AUTOCONF_TIMESTAMP  -Wall -Wshadow -Wwrite-strings -Wundef -Wstrict-prototypes -Wunused -Wunused-parameter -Wunused-function -Wunused-value -Wmissing-prototypes -Wmissing-declarations -Wdeclaration-after-statement -Wold-style-definition -fno-builtin-strlen -finline-limit=0 -fomit-frame-pointer -ffunction-sections -fdata-sections -fno-guess-branch-probability -funsigned-char -static-libgcc -falign-functions=1 -falign-jumps=1 -falign-labels=1 -falign-loops=1 -Os  -march=i386 -mpreferred-stack-boundary=2    -D"KBUILD_STR(s)=#s" -D"KBUILD_BASENAME=KBUILD_STR(uuencode)"  -D"KBUILD_MODNAME=KBUILD_STR(uuencode)" -c -o libbb/uuencode.o libbb/uuencode.c
*  gcc -Wp,-MD,libbb/.vdprintf.o.d   -std=gnu99 -Iinclude -Ilibbb  -include include/autoconf.h -D_GNU_SOURCE -DNDEBUG -D_LARGEFILE_SOURCE -D_LARGEFILE64_SOURCE -D_FILE_OFFSET_BITS=64 -D"BB_VER=KBUILD_STR(1.20.2)" -DBB_BT=AUTOCONF_TIMESTAMP  -Wall -Wshadow -Wwrite-strings -Wundef -Wstrict-prototypes -Wunused -Wunused-parameter -Wunused-function -Wunused-value -Wmissing-prototypes -Wmissing-declarations -Wdeclaration-after-statement -Wold-style-definition -fno-builtin-strlen -finline-limit=0 -fomit-frame-pointer -ffunction-sections -fdata-sections -fno-guess-branch-probability -funsigned-char -static-libgcc -falign-functions=1 -falign-jumps=1 -falign-labels=1 -falign-loops=1 -Os  -march=i386 -mpreferred-stack-boundary=2    -D"KBUILD_STR(s)=#s" -D"KBUILD_BASENAME=KBUILD_STR(vdprintf)"  -D"KBUILD_MODNAME=KBUILD_STR(vdprintf)" -c -o libbb/vdprintf.o libbb/vdprintf.c
*  gcc -Wp,-MD,libbb/.verror_msg.o.d   -std=gnu99 -Iinclude -Ilibbb  -include include/autoconf.h -D_GNU_SOURCE -DNDEBUG -D_LARGEFILE_SOURCE -D_LARGEFILE64_SOURCE -D_FILE_OFFSET_BITS=64 -D"BB_VER=KBUILD_STR(1.20.2)" -DBB_BT=AUTOCONF_TIMESTAMP  -Wall -Wshadow -Wwrite-strings -Wundef -Wstrict-prototypes -Wunused -Wunused-parameter -Wunused-function -Wunused-value -Wmissing-prototypes -Wmissing-declarations -Wdeclaration-after-statement -Wold-style-definition -fno-builtin-strlen -finline-limit=0 -fomit-frame-pointer -ffunction-sections -fdata-sections -fno-guess-branch-probability -funsigned-char -static-libgcc -falign-functions=1 -falign-jumps=1 -falign-labels=1 -falign-loops=1 -Os  -march=i386 -mpreferred-stack-boundary=2    -D"KBUILD_STR(s)=#s" -D"KBUILD_BASENAME=KBUILD_STR(verror_msg)"  -D"KBUILD_MODNAME=KBUILD_STR(verror_msg)" -c -o libbb/verror_msg.o libbb/verror_msg.c
*libbb/update_passwd.c: In function 'update_passwd':
*libbb/update_passwd.c:138:3: warning: ignoring return value of 'fchown', declared with attribute warn_unused_result [-Wunused-result]
*--
*  gcc -Wp,-MD,libbb/.xgetcwd.o.d   -std=gnu99 -Iinclude -Ilibbb  -include include/autoconf.h -D_GNU_SOURCE -DNDEBUG -D_LARGEFILE_SOURCE -D_LARGEFILE64_SOURCE -D_FILE_OFFSET_BITS=64 -D"BB_VER=KBUILD_STR(1.20.2)" -DBB_BT=AUTOCONF_TIMESTAMP  -Wall -Wshadow -Wwrite-strings -Wundef -Wstrict-prototypes -Wunused -Wunused-parameter -Wunused-function -Wunused-value -Wmissing-prototypes -Wmissing-declarations -Wdeclaration-after-statement -Wold-style-definition -fno-builtin-strlen -finline-limit=0 -fomit-frame-pointer -ffunction-sections -fdata-sections -fno-guess-branch-probability -funsigned-char -static-libgcc -falign-functions=1 -falign-jumps=1 -falign-labels=1 -falign-loops=1 -Os  -march=i386 -mpreferred-stack-boundary=2    -D"KBUILD_STR(s)=#s" -D"KBUILD_BASENAME=KBUILD_STR(xgetcwd)"  -D"KBUILD_MODNAME=KBUILD_STR(xgetcwd)" -c -o libbb/xgetcwd.o libbb/xgetcwd.c
*  gcc -Wp,-MD,libbb/.xgethostbyname.o.d   -std=gnu99 -Iinclude -Ilibbb  -include include/autoconf.h -D_GNU_SOURCE -DNDEBUG -D_LARGEFILE_SOURCE -D_LARGEFILE64_SOURCE -D_FILE_OFFSET_BITS=64 -D"BB_VER=KBUILD_STR(1.20.2)" -DBB_BT=AUTOCONF_TIMESTAMP  -Wall -Wshadow -Wwrite-strings -Wundef -Wstrict-prototypes -Wunused -Wunused-parameter -Wunused-function -Wunused-value -Wmissing-prototypes -Wmissing-declarations -Wdeclaration-after-statement -Wold-style-definition -fno-builtin-strlen -finline-limit=0 -fomit-frame-pointer -ffunction-sections -fdata-sections -fno-guess-branch-probability -funsigned-char -static-libgcc -falign-functions=1 -falign-jumps=1 -falign-labels=1 -falign-loops=1 -Os  -march=i386 -mpreferred-stack-boundary=2    -D"KBUILD_STR(s)=#s" -D"KBUILD_BASENAME=KBUILD_STR(xgethostbyname)"  -D"KBUILD_MODNAME=KBUILD_STR(xgethostbyname)" -c -o libbb/xgethostbyname.o libbb/xgethostbyname.c
*  gcc -Wp,-MD,libbb/.xreadlink.o.d   -std=gnu99 -Iinclude -Ilibbb  -include include/autoconf.h -D_GNU_SOURCE -DNDEBUG -D_LARGEFILE_SOURCE -D_LARGEFILE64_SOURCE -D_FILE_OFFSET_BITS=64 -D"BB_VER=KBUILD_STR(1.20.2)" -DBB_BT=AUTOCONF_TIMESTAMP  -Wall -Wshadow -Wwrite-strings -Wundef -Wstrict-prototypes -Wunused -Wunused-parameter -Wunused-function -Wunused-value -Wmissing-prototypes -Wmissing-declarations -Wdeclaration-after-statement -Wold-style-definition -fno-builtin-strlen -finline-limit=0 -fomit-frame-pointer -ffunction-sections -fdata-sections -fno-guess-branch-probability -funsigned-char -static-libgcc -falign-functions=1 -falign-jumps=1 -falign-labels=1 -falign-loops=1 -Os  -march=i386 -mpreferred-stack-boundary=2    -D"KBUILD_STR(s)=#s" -D"KBUILD_BASENAME=KBUILD_STR(xreadlink)"  -D"KBUILD_MODNAME=KBUILD_STR(xreadlink)" -c -o libbb/xreadlink.o libbb/xreadlink.c
*  gcc -Wp,-MD,libbb/.xrealloc_vector.o.d   -std=gnu99 -Iinclude -Ilibbb  -include include/autoconf.h -D_GNU_SOURCE -DNDEBUG -D_LARGEFILE_SOURCE -D_LARGEFILE64_SOURCE -D_FILE_OFFSET_BITS=64 -D"BB_VER=KBUILD_STR(1.20.2)" -DBB_BT=AUTOCONF_TIMESTAMP  -Wall -Wshadow -Wwrite-strings -Wundef -Wstrict-prototypes -Wunused -Wunused-parameter -Wunused-function -Wunused-value -Wmissing-prototypes -Wmissing-declarations -Wdeclaration-after-statement -Wold-style-definition -fno-builtin-strlen -finline-limit=0 -fomit-frame-pointer -ffunction-sections -fdata-sections -fno-guess-branch-probability -funsigned-char -static-libgcc -falign-functions=1 -falign-jumps=1 -falign-labels=1 -falign-loops=1 -Os  -march=i386 -mpreferred-stack-boundary=2    -D"KBUILD_STR(s)=#s" -D"KBUILD_BASENAME=KBUILD_STR(xrealloc_vector)"  -D"KBUILD_MODNAME=KBUILD_STR(xrealloc_vector)" -c -o libbb/xrealloc_vector.o libbb/xrealloc_vector.c
*libbb/xfuncs_printf.c: In function 'generate_uuid':
*libbb/xfuncs_printf.c:593:3: warning: ignoring return value of 'read', declared with attribute warn_unused_result [-Wunused-result]
*--
*make[1]: Leaving directory '/var/tmp/genkernel/19213.28001.8144.1240/LVM2.2.02.88/man'
*gcc -c -I. -I../include -DHAVE_CONFIG_H -DDM_IOCTLS -fPIC -fPIC -Wall -Wundef -Wshadow -Wcast-align -Wwrite-strings -Wmissing-prototypes -Wmissing-declarations -Wnested-externs -Winline -Wmissing-noreturn -Wformat-security -Wredundant-decls -Wpointer-arith -O2 device/dev-io.c -o device/dev-io.o
*gcc -c -I. -I../include -DHAVE_CONFIG_H -DDM_IOCTLS -fPIC -fPIC -Wall -Wundef -Wshadow -Wcast-align -Wwrite-strings -Wmissing-prototypes -Wmissing-declarations -Wnested-externs -Winline -Wmissing-noreturn -Wformat-security -Wredundant-decls -Wpointer-arith -O2 device/dev-md.c -o device/dev-md.o
*gcc -c -I. -I../include -DHAVE_CONFIG_H -DDM_IOCTLS -fPIC -fPIC -Wall -Wundef -Wshadow -Wcast-align -Wwrite-strings -Wmissing-prototypes -Wmissing-declarations -Wnested-externs -Winline -Wmissing-noreturn -Wformat-security -Wredundant-decls -Wpointer-arith -O2 device/dev-swap.c -o device/dev-swap.o
*device/dev-md.c: In function 'dev_is_md':
*device/dev-md.c:76:12: warning: 'sb_offset' may be used uninitialized in this function [-Wmaybe-uninitialized]
*--
*../include/util.h:29:30: note: in definition of macro 'uninitialized_var'
* #define uninitialized_var(x) x
*                              ^
*gcc -c -I. -I../include -DHAVE_CONFIG_H -DDM_IOCTLS -fPIC -fPIC -Wall -Wundef -Wshadow -Wcast-align -Wwrite-strings -Wmissing-prototypes -Wmissing-declarations -Wnested-externs -Winline -Wmissing-noreturn -Wformat-security -Wredundant-decls -Wpointer-arith -O2 device/dev-luks.c -o device/dev-luks.o
*commands/toolcontext.c: In function '_init_dev_cache':
*commands/toolcontext.c:666:16: warning: 'udev_dir' may be used uninitialized in this function [-Wmaybe-uninitialized]
*        udev_dir[len] != cv->v.str[len]) {
*                ^
*commands/toolcontext.c:664:8: warning: 'udev_dir_len' may be used uninitialized in this function [-Wmaybe-uninitialized]
*--
*gcc -c -I. -I../include -DHAVE_CONFIG_H -DDM_IOCTLS -fPIC -fPIC -Wall -Wundef -Wshadow -Wcast-align -Wwrite-strings -Wmissing-prototypes -Wmissing-declarations -Wnested-externs -Winline -Wmissing-noreturn -Wformat-security -Wredundant-decls -Wpointer-arith -O2 mirror/mirrored.c -o mirror/mirrored.o
*gcc -c -I. -I../include -DHAVE_CONFIG_H -DDM_IOCTLS -fPIC -fPIC -Wall -Wundef -Wshadow -Wcast-align -Wwrite-strings -Wmissing-prototypes -Wmissing-declarations -Wnested-externs -Winline -Wmissing-noreturn -Wformat-security -Wredundant-decls -Wpointer-arith -O2 raid/raid.c -o raid/raid.o
*gcc -c -I. -I../include -DHAVE_CONFIG_H -DDM_IOCTLS -fPIC -fPIC -Wall -Wundef -Wshadow -Wcast-align -Wwrite-strings -Wmissing-prototypes -Wmissing-declarations -Wnested-externs -Winline -Wmissing-noreturn -Wformat-security -Wredundant-decls -Wpointer-arith -O2 activate/dev_manager.c -o activate/dev_manager.o
*gcc -c -I. -I../include -DHAVE_CONFIG_H -DDM_IOCTLS -fPIC -fPIC -Wall -Wundef -Wshadow -Wcast-align -Wwrite-strings -Wmissing-prototypes -Wmissing-declarations -Wnested-externs -Winline -Wmissing-noreturn -Wformat-security -Wredundant-decls -Wpointer-arith -O2 activate/fs.c -o activate/fs.o
*metadata/metadata.c: In function '_get_pvs':
*metadata/metadata.c:3674:12: warning: 'results' may be used uninitialized in this function [-Wmaybe-uninitialized]
*--
*gcc -c -I. -I../include -DLVM_SHARED_PATH=\"//sbin/lvm\" -DHAVE_CONFIG_H -DDM_IOCTLS -fPIC -fPIC -Wall -Wundef -Wshadow -Wcast-align -Wwrite-strings -Wmissing-prototypes -Wmissing-declarations -Wnested-externs -Winline -Wmissing-noreturn -Wformat-security -Wredundant-decls -Wpointer-arith -O2 pvdisplay.c -o pvdisplay.o
*gcc -c -I. -I../include -DLVM_SHARED_PATH=\"//sbin/lvm\" -DHAVE_CONFIG_H -DDM_IOCTLS -fPIC -fPIC -Wall -Wundef -Wshadow -Wcast-align -Wwrite-strings -Wmissing-prototypes -Wmissing-declarations -Wnested-externs -Winline -Wmissing-noreturn -Wformat-security -Wredundant-decls -Wpointer-arith -O2 pvmove.c -o pvmove.o
*gcc -c -I. -I../include -DLVM_SHARED_PATH=\"//sbin/lvm\" -DHAVE_CONFIG_H -DDM_IOCTLS -fPIC -fPIC -Wall -Wundef -Wshadow -Wcast-align -Wwrite-strings -Wmissing-prototypes -Wmissing-declarations -Wnested-externs -Winline -Wmissing-noreturn -Wformat-security -Wredundant-decls -Wpointer-arith -O2 pvremove.c -o pvremove.o
*gcc -c -I. -I../include -DLVM_SHARED_PATH=\"//sbin/lvm\" -DHAVE_CONFIG_H -DDM_IOCTLS -fPIC -fPIC -Wall -Wundef -Wshadow -Wcast-align -Wwrite-strings -Wmissing-prototypes -Wmissing-declarations -Wnested-externs -Winline -Wmissing-noreturn -Wformat-security -Wredundant-decls -Wpointer-arith -O2 pvresize.c -o pvresize.o
*lvconvert.c: In function '_lvconvert_single':
*lvconvert.c:1450:10: warning: 'image_count' may be used uninitialized in this function [-Wmaybe-uninitialized]
*--
*	-llvm-internal  -ldl -ldevmapper    -rdynamic
*gcc -fPIC -fPIC -Wall -Wundef -Wshadow -Wcast-align -Wwrite-strings -Wmissing-prototypes -Wmissing-declarations -Wnested-externs -Winline -Wmissing-noreturn -Wformat-security -Wredundant-decls -Wpointer-arith -O2 -Wl,--export-dynamic -L../libdm -L../lib -Wl,--no-export-dynamic -static -L../libdm/ioctl -o lvm.static \
*      dumpconfig.o formats.o lvchange.o lvconvert.o lvcreate.o lvdisplay.o lvextend.o lvmchange.o lvmcmdline.o lvmdiskscan.o lvreduce.o lvremove.o lvrename.o lvresize.o lvscan.o polldaemon.o pvchange.o pvck.o pvcreate.o pvdisplay.o pvmove.o pvremove.o pvresize.o pvscan.o reporter.o segtypes.o toollib.o vgcfgbackup.o vgcfgrestore.o vgchange.o vgck.o vgcreate.o vgconvert.o vgdisplay.o vgexport.o vgextend.o vgimport.o vgmerge.o vgmknodes.o vgreduce.o vgremove.o vgrename.o vgscan.o vgsplit.o lvm-static.o -llvm-internal  -ldl -ldevmapper    
*ar rs liblvm2cmd.a dumpconfig.o formats.o lvchange.o lvconvert.o lvcreate.o lvdisplay.o lvextend.o lvmchange.o lvmcmdline.o lvmdiskscan.o lvreduce.o lvremove.o lvrename.o lvresize.o lvscan.o polldaemon.o pvchange.o pvck.o pvcreate.o pvdisplay.o pvmove.o pvremove.o pvresize.o pvscan.o reporter.o segtypes.o toollib.o vgcfgbackup.o vgcfgrestore.o vgchange.o vgck.o vgcreate.o vgconvert.o vgdisplay.o vgexport.o vgextend.o vgimport.o vgmerge.o vgmknodes.o vgreduce.o vgremove.o vgrename.o vgscan.o vgsplit.o lvmcmdlib.o lvm2cmd.o
*../lib/liblvm-internal.a(sharedlib.o): In function `load_shared_library':
*sharedlib.c:(.text+0x147): warning: Using 'dlopen' in statically linked applications requires at runtime the shared libraries from the glibc version used for linking
*--
*checking getopt.h presence... yes
*checking for getopt.h... yes
*checking for dlopen in -ldl... yes
*checking for pthread_mutex_lock in -lpthread... yes
*checking for dm_event_handler_create in -ldevmapper-event... no
*configure: error: device-mapper-event library is either missing or is too old and badly linked
*--
* Running with options: --callback=emerge -qN app-accessibility/espeakup media-libs/alsa-oss media-sound/alsa-utils net-dialup/globespan-adsl net-wireless/hostap-utils sys-apps/pcmciautils sys-kernel/linux-firmware --lvm --dmraid --mdadm --makeopts=-j8 --cachedir=/tmp/kerncache/gentoo-genkernel_cache-20151020 --no-mountboot --kerneldir=/usr/src/linux --modulespackage=/tmp/kerncache/gentoo-modules-20151020.tar.bz2 --minkernpackage=/tmp/kerncache/gentoo-kernel-initrd-20151020.tar.bz2 all --kernel-config=/var/tmp/gentoo.config
* Using genkernel.conf from /etc/genkernel.conf
* Sourcing arch-specific config.sh from /usr/share/genkernel/arch/x86/config.sh ..
* Sourcing arch-specific modules_load from /usr/share/genkernel/arch/x86/modules_load ..
*
* ERROR: Configure of dmraid failed!
* 
* -- End log... --
* 
* Please consult /var/log/genkernel.log for more information and any
* errors that were reported above.
* 
* Report any genkernel bugs to bugs.gentoo.org and
* assign your bug to genkernel@g.o. Please include
* as much information as you can in your bug report; attaching
* /var/log/genkernel.log so that your issue can be dealt with effectively.
* 
* Please do *not* report compilation failures as genkernel bugs!
* 

!!! catalyst: Runscript kernel build failed


Traceback (most recent call last):
  File "modules/generic_stage_target.py", line 1428, in build_kernel
    self._build_kernel(kname=kname)
  File "modules/generic_stage_target.py", line 1472, in _build_kernel
    "Runscript kernel build failed",env=self.env)
  File "/usr/lib64/catalyst//modules/catalyst_support.py", line 541, in cmd
    raise CatalystError,myexc
CatalystError
None

!!! catalyst: build aborting due to kernel build error.

Traceback (most recent call last):
File "/usr/lib64/catalyst/catalyst", line 218, in build_target
    mytarget.run()
File "modules/generic_stage_target.py", line 1304, in run
    apply(getattr(self,x))
File "modules/generic_stage_target.py", line 1433, in build_kernel
    "build aborting due to kernel build error."
CatalystError
!!! catalyst: Error encountered during run of target livecd-stage2
Catalyst aborting....
lockfile does not exist '/release/buildroot/x86-dev/tmp/default/livecd-stage2-x86-20151020/.catalyst_lock'



Full build log at /release/tmp/run/catalyst-auto.HGlFsk/log/installcd-stage2-minimal.log