Gentoo Archives: gentoo-releng-autobuilds

From: root <vapier@g.o>
To: releng@g.o, gentoo-releng-autobuilds@l.g.o
Subject: [gentoo-releng-autobuilds] [s390x-auto] Catalyst fatal build error - stage3.spec
Date: Thu, 20 Sep 2018 14:25:14
Message-Id: 20180920142508.3930620543@nightheron.gentoo.org
make[3]: *** [Makefile:417: all] Error 2
make[3]: Leaving directory '/var/tmp/portage/sys-devel/gcc-7.3.0-r3/work/build/s390x-ibm-linux-gnu/libstdc++-v3'
make[2]: *** [Makefile:14349: all-stage1-target-libstdc++-v3] Error 2
make[2]: Leaving directory '/var/tmp/portage/sys-devel/gcc-7.3.0-r3/work/build'
make[1]: *** [Makefile:20902: stage1-bubble] Error 2
make[1]: Leaving directory '/var/tmp/portage/sys-devel/gcc-7.3.0-r3/work/build'
make: *** [Makefile:21234: bootstrap-lean] Error 2
 * ERROR: sys-devel/gcc-7.3.0-r3::gentoo failed (compile phase):
 *   emake failed
 * 
 * If you need support, post the output of `emerge --info '=sys-devel/gcc-7.3.0-r3::gentoo'`,
 * the complete build log and the output of `emerge -pqv '=sys-devel/gcc-7.3.0-r3::gentoo'`.
 * The complete build log is located at '/var/tmp/portage/sys-devel/gcc-7.3.0-r3/temp/build.log'.
 * The ebuild environment file is located at '/var/tmp/portage/sys-devel/gcc-7.3.0-r3/temp/environment'.
 * Working directory: '/var/tmp/portage/sys-devel/gcc-7.3.0-r3/work/build'
 * S: '/var/tmp/portage/sys-devel/gcc-7.3.0-r3/work/gcc-7.3.0'
 * 
 * Please include /var/tmp/portage/sys-devel/gcc-7.3.0-r3/work/gcc-build-logs.tar.bz2 in your bug report.
 * 
 * Messages for package sys-fs/eudev-3.2.5:
 * 
 * As of 2013-01-29, eudev-3.2.5 provides the new interface renaming functionality,
 * as described in the URL below:
 * https://www.freedesktop.org/wiki/Software/systemd/PredictableNetworkInterfaceNames
 * 
 * This functionality is enabled BY DEFAULT because eudev has no means of synchronizing
 * between the default or user-modified choice of sys-fs/udev.  If you wish to disable
 * this new iface naming, please be sure that /etc/udev/rules.d/80-net-name-slot.rules
 * exists: touch /etc/udev/rules.d/80-net-name-slot.rules
 * 
 * Messages for package sys-apps/opentmpfiles-0.1.3:
 * Auto-adding 'opentmpfiles-dev' service to your sysinit runlevel
 * Auto-adding 'opentmpfiles-setup' service to your boot runlevel
 * Messages for package sys-apps/baselayout-2.4.1-r2:
 * The following users have non-existent shells!
 * halt - /sbin/halt
 * shutdown - /sbin/shutdown
 * You should reboot now to get /run mounted with tmpfs!
 * Messages for package sys-libs/timezone-data-2018e:
 * You do not have TIMEZONE set in /etc/timezone.
 * Skipping auto-update of /etc/localtime.
 * Messages for package sys-apps/sysvinit-2.88-r9:
 * The last/lastb/mesg/mountpoint/sulogin/utmpdump/wall tools have been moved to
 * sys-apps/util-linux. The pidof tool has been moved to sys-process/procps.
 * Messages for package net-mail/mailbase-1.1:
 * Your /var/spool/mail/ directory permissions differ from
 *   those which mailbase wants to set it to (03775).
 *   If you did not change them on purpose, consider running:
 * 
 *     chown root:mail /var/spool/mail/
 *     chmod 03775 /var/spool/mail/
 * Messages for package sys-libs/pam-1.2.1-r2:
 * Some software with pre-loaded PAM libraries might experience
 * warnings or failures related to missing symbols and/or versions
 * after any update. While unfortunate this is a limit of the
 * implementation of PAM and the software, and it requires you to
 * restart the software manually after the update.
 * 
 * You can get a list of such software running a command like
 *   lsof / | egrep -i 'del.*libpam\.so'
 * 
 * Alternatively, simply reboot your system.
 * Messages for package sys-apps/busybox-1.29.0:
 * Could not locate user configfile, so we will save a default one
 * Your configuration for sys-apps/busybox-1.29.0 has been saved in 
 * /etc/portage/savedconfig/sys-apps/busybox-1.29.0 for your editing pleasure.
 * You can edit these files by hand and remerge this package with
 * USE=savedconfig to customise the configuration.
 * You can rename this file/directory to one of the following for
 * its configuration to apply to multiple versions:
 * ${PORTAGE_CONFIGROOT}/etc/portage/savedconfig/
 * [${CTARGET}|${CHOST}|""]/${CATEGORY}/[${PF}|${P}|${PN}]
 * Messages for package sys-apps/util-linux-2.32-r4:
 * The mesg/wall/write tools have been disabled due to USE=-tty-helpers.
 * The agetty util now clears the terminal by default. You
 * might want to add --noclear to your /etc/inittab lines.
 * Messages for package sys-apps/coreutils-8.29-r1:
 * Make sure you run 'hash -r' in your active shells.
 * You should also re-source your shell settings for LS_COLORS
 *   changes, such as: source /etc/profile
 * Messages for package sys-apps/man-db-2.7.6.1-r2:
 * Defaulting to USE=gdbm due to ambiguous berkdb/gdbm USE flag settings
 * Messages for package sys-apps/openrc-0.34.11:
 * Auto-adding 'termencoding' service to your boot runlevel
 * Auto-adding 'sysfs' service to your sysinit runlevel
 * Auto-adding 'loopback' service to your boot runlevel
 * Auto-adding 'binfmt' service to your boot runlevel
 * Auto-adding 'mtab' service to your boot runlevel
 * Messages for package net-misc/netifrc-0.5.1:
 * The network configuration scripts will use dhcp by
 * default to set up your interfaces.
 * If you need to set up something more complete, see
 * //usr/share/doc/netifrc-0.5.1/README
 * Messages for package sys-fs/eudev-3.2.5:
 * Unable to find kernel sources at /usr/src/linux
 * Unable to calculate Linux Kernel version for build, attempting to use running version
 * Unable to check for the following kernel config options due
 * to absence of any configured kernel sources or compiled
 * config:
 *  - BLK_DEV_BSG
 *  - DEVTMPFS
 *  - IDE
 *  - INOTIFY_USER
 *  - SYSFS_DEPRECATED
 *  - SYSFS_DEPRECATED_V2
 *  - SIGNALFD
 *  - EPOLL
 *  - FHANDLE
 *  - NET
 *  - UNIX
 * You're on your own to make sure they are set if needed.
 * 
 * For more information on eudev on Gentoo, writing udev rules, and
 * fixing known issues visit: https://wiki.gentoo.org/wiki/Eudev
 * Messages for package dev-libs/glib-2.52.3:
 * Unable to find kernel sources at /usr/src/linux
 * Unable to calculate Linux Kernel version for build, attempting to use running version
 * Unable to check for the following kernel config options due
 * to absence of any configured kernel sources or compiled
 * config:
 *  - INOTIFY_USER
 * You're on your own to make sure they are set if needed.
 * Messages for package sys-libs/glibc-2.26-r7:
 * Applying Gentoo Glibc Patchset 2.26-7
 * Generating all locales; edit /etc/locale.gen to save time/space
 * Messages for package sys-devel/gcc-7.3.0-r3:
 * ERROR: sys-devel/gcc-7.3.0-r3::gentoo failed (compile phase):
 *   emake failed
 * 
 * If you need support, post the output of `emerge --info '=sys-devel/gcc-7.3.0-r3::gentoo'`,
 * the complete build log and the output of `emerge -pqv '=sys-devel/gcc-7.3.0-r3::gentoo'`.
 * The complete build log is located at '/var/tmp/portage/sys-devel/gcc-7.3.0-r3/temp/build.log'.
 * The ebuild environment file is located at '/var/tmp/portage/sys-devel/gcc-7.3.0-r3/temp/environment'.
 * Working directory: '/var/tmp/portage/sys-devel/gcc-7.3.0-r3/work/build'
 * S: '/var/tmp/portage/sys-devel/gcc-7.3.0-r3/work/gcc-7.3.0'
 * 
 * Please include /var/tmp/portage/sys-devel/gcc-7.3.0-r3/work/gcc-build-logs.tar.bz2 in your bug report.
 * 



































!!! catalyst: run script failed.


Traceback (most recent call last):
  File "modules/generic_stage_target.py", line 1244, in run_local
    "run script failed.",env=self.env)
  File "/usr/lib64/catalyst/modules/catalyst_support.py", line 541, in cmd
    raise CatalystError,myexc
CatalystError
None

!!! catalyst: Stage build aborting due to error.

Traceback (most recent call last):
File "/usr/lib64/catalyst/catalyst", line 218, in build_target
    mytarget.run()
File "modules/generic_stage_target.py", line 1304, in run
    apply(getattr(self,x))
File "modules/generic_stage_target.py", line 1249, in run_local
    raise CatalystError,"Stage build aborting due to error."
CatalystError
!!! catalyst: Error encountered during run of target stage3
Catalyst aborting....
lockfile does not exist '/var/tmp/catalyst/tmp/default/stage3-s390x-20180920T091130Z/.catalyst_lock'
Command exited with non-zero status 1
5413.47user 1459.99system 1:24:37elapsed 135%CPU (0avgtext+0avgdata 2595056maxresident)k
0inputs+0outputs (1972major+816024167minor)pagefaults 0swaps



Full build log at /tmp/catalyst-auto.20180920T091130Z.0IQxqF/log/stage3.log