Gentoo Archives: gentoo-releng-autobuilds

From: catalyst@××××××××××××××××.name
To: jmbsvicetto@×××××.com, gentoo-releng-autobuilds@l.g.o
Subject: [gentoo-releng-autobuilds] [amd64-auto] Catalyst fatal build error - stage1.spec
Date: Fri, 07 Feb 2020 16:59:02
Message-Id: 20200207165852.A42D76339B@thor.jmbsvicetto.name
1 libcommon.a ../libcpp/libcpp.a ../libbacktrace/.libs/libbacktrace.a ../libiberty/libiberty.a ../libdecnumber/libdecnumber.a
2 /var/tmp/portage/sys-devel/gcc-9.2.0-r2/work/build/./prev-gcc/xg++ -B/var/tmp/portage/sys-devel/gcc-9.2.0-r2/work/build/./prev-gcc/ -B/usr/x86_64-pc-linux-gnu/bin/ -nostdinc++ -B/var/tmp/portage/sys-devel/gcc-9.2.0-r2/work/build/prev-x86_64-pc-linux-gnu/libstdc++-v3/src/.libs -B/var/tmp/portage/sys-devel/gcc-9.2.0-r2/work/build/prev-x86_64-pc-linux-gnu/libstdc++-v3/libsupc++/.libs -isystem /var/tmp/portage/sys-devel/gcc-9.2.0-r2/work/build/prev-x86_64-pc-linux-gnu/libstdc++-v3/include/x86_64-pc-linux-gnu -isystem /var/tmp/portage/sys-devel/gcc-9.2.0-r2/work/build/prev-x86_64-pc-linux-gnu/libstdc++-v3/include -isystem /var/tmp/portage/sys-devel/gcc-9.2.0-r2/work/gcc-9.2.0/libstdc++-v3/libsupc++ -L/var/tmp/portage/sys-devel/gcc-9.2.0-r2/work/build/prev-x86_64-pc-linux-gnu/libstdc++-v3/src/.libs -L/var/tmp/portage/sys-devel/gcc-9.2.0-r2/work/build/prev-x86_64-pc-linux-gnu/libstdc++-v3/libsupc++/.libs -no-pie -fno-PIE -m64 -O2 -pipe -fno-checking -gtoggle -DIN_GCC -fno-exceptio
3 ns -fno-rtti -fasynchronous-unwind-tables -W -Wall -Wno-narrowing -Wwrite-strings -Wcast-qual -Wmissing-format-attribute -Woverloaded-virtual -pedantic -Wno-long-long -Wno-variadic-macros -Wno-overlength-strings -DHAVE_CONFIG_H -static-libstdc++ -static-libgcc -o cpp gcc.o gcc-main.o ggc-none.o \
4 c-family/cppspec.o driver-i386.o libcommon-target.a \
5 libcommon.a ../libcpp/libcpp.a ../libbacktrace/.libs/libbacktrace.a ../libiberty/libiberty.a ../libdecnumber/libdecnumber.a
6 /var/tmp/portage/sys-devel/gcc-9.2.0-r2/work/gcc-9.2.0/gcc/lto/lto.c: In function 'void lto_resolution_read(splay_tree, FILE*, lto_file*)':
7 /var/tmp/portage/sys-devel/gcc-9.2.0-r2/work/gcc-9.2.0/gcc/lto/lto.c:1918:10: warning: ignoring return value of 'int fscanf(FILE*, const char*, ...)', declared with attribute warn_unused_result [-Wunused-result]
8 1918 | fscanf (resolution, " "); /* Read white space. */
9 | ~~~~~~~^~~~~~~~~~~~~~~~~
10 /var/tmp/portage/sys-devel/gcc-9.2.0-r2/work/gcc-9.2.0/gcc/lto/lto.c:1920:9: warning: ignoring return value of 'size_t fread(void*, size_t, size_t, FILE*)', declared with attribute warn_unused_result [-Wunused-result]
11 1920 | fread (obj_name, sizeof (char), name_len, resolution);
12 | ~~~~~~^~~~~~~~~~~~~~~~~~~~~~~~~~~~~~~~~~~~~~~~~~~~~~~
13 /var/tmp/portage/sys-devel/gcc-9.2.0-r2/work/gcc-9.2.0/gcc/lto/lto.c:1940:10: warning: ignoring return value of 'int fscanf(FILE*, const char*, ...)', declared with attribute warn_unused_result [-Wunused-result]
14 1940 | fscanf (resolution, "%u", &num_symbols);
15 | ~~~~~~~^~~~~~~~~~~~~~~~~~~~~~~~~~~~~~~~
16 /var/tmp/portage/sys-devel/gcc-9.2.0-r2/work/build/./prev-gcc/xg++ -B/var/tmp/portage/sys-devel/gcc-9.2.0-r2/work/build/./prev-gcc/ -B/usr/x86_64-pc-linux-gnu/bin/ -nostdinc++ -B/var/tmp/portage/sys-devel/gcc-9.2.0-r2/work/build/prev-x86_64-pc-linux-gnu/libstdc++-v3/src/.libs -B/var/tmp/portage/sys-devel/gcc-9.2.0-r2/work/build/prev-x86_64-pc-linux-gnu/libstdc++-v3/libsupc++/.libs -isystem /var/tmp/portage/sys-devel/gcc-9.2.0-r2/work/build/prev-x86_64-pc-linux-gnu/libstdc++-v3/include/x86_64-pc-linux-gnu -isystem /var/tmp/portage/sys-devel/gcc-9.2.0-r2/work/build/prev-x86_64-pc-linux-gnu/libstdc++-v3/include -isystem /var/tmp/portage/sys-devel/gcc-9.2.0-r2/work/gcc-9.2.0/libstdc++-v3/libsupc++ -L/var/tmp/portage/sys-devel/gcc-9.2.0-r2/work/build/prev-x86_64-pc-linux-gnu/libstdc++-v3/src/.libs -L/var/tmp/portage/sys-devel/gcc-9.2.0-r2/work/build/prev-x86_64-pc-linux-gnu/libstdc++-v3/libsupc++/.libs -no-pie -fno-PIE -m64 -O2 -pipe -fno-checking -gtoggle -DIN_GCC -fno-exceptio
17 ns -fno-rtti -fasynchronous-unwind-tables -W -Wall -Wno-narrowing -Wwrite-strings -Wcast-qual -Wmissing-format-attribute -Woverloaded-virtual -pedantic -Wno-long-long -Wno-variadic-macros -Wno-overlength-strings -DHAVE_CONFIG_H -static-libstdc++ -static-libgcc -o xg++ \
18 gcc.o gcc-main.o ggc-none.o cp/g++spec.o driver-i386.o libcommon-target.a \
19 libcommon.a ../libcpp/libcpp.a ../libbacktrace/.libs/libbacktrace.a ../libiberty/libiberty.a ../libdecnumber/libdecnumber.a
20 /var/tmp/portage/sys-devel/gcc-9.2.0-r2/work/build/./gcc/xgcc -B/var/tmp/portage/sys-devel/gcc-9.2.0-r2/work/build/./gcc/ -dumpspecs > tmp-specs
21 mv tmp-specs specs
22 /var/tmp/portage/sys-devel/gcc-9.2.0-r2/work/build/./prev-gcc/xg++ -B/var/tmp/portage/sys-devel/gcc-9.2.0-r2/work/build/./prev-gcc/ -B/usr/x86_64-pc-linux-gnu/bin/ -nostdinc++ -B/var/tmp/portage/sys-devel/gcc-9.2.0-r2/work/build/prev-x86_64-pc-linux-gnu/libstdc++-v3/src/.libs -B/var/tmp/portage/sys-devel/gcc-9.2.0-r2/work/build/prev-x86_64-pc-linux-gnu/libstdc++-v3/libsupc++/.libs -isystem /var/tmp/portage/sys-devel/gcc-9.2.0-r2/work/build/prev-x86_64-pc-linux-gnu/libstdc++-v3/include/x86_64-pc-linux-gnu -isystem /var/tmp/portage/sys-devel/gcc-9.2.0-r2/work/build/prev-x86_64-pc-linux-gnu/libstdc++-v3/include -isystem /var/tmp/portage/sys-devel/gcc-9.2.0-r2/work/gcc-9.2.0/libstdc++-v3/libsupc++ -L/var/tmp/portage/sys-devel/gcc-9.2.0-r2/work/build/prev-x86_64-pc-linux-gnu/libstdc++-v3/src/.libs -L/var/tmp/portage/sys-devel/gcc-9.2.0-r2/work/build/prev-x86_64-pc-linux-gnu/libstdc++-v3/libsupc++/.libs -no-pie -fno-PIE -m64 -O2 -pipe -fno-checking -gtoggle -DIN_GCC -fno-exceptio
23 ns -fno-rtti -fasynchronous-unwind-tables -W -Wall -Wno-narrowing -Wwrite-strings -Wcast-qual -Wmissing-format-attribute -Woverloaded-virtual -pedantic -Wno-long-long -Wno-variadic-macros -Wno-overlength-strings -DHAVE_CONFIG_H -static-libstdc++ -static-libgcc gcov-tool.o libgcov-util.o libgcov-driver-tool.o libgcov-merge-tool.o libcommon.a ../libcpp/libcpp.a ../libbacktrace/.libs/libbacktrace.a ../libiberty/libiberty.a ../libdecnumber/libdecnumber.a -o gcov-tool
24 if /var/tmp/portage/sys-devel/gcc-9.2.0-r2/work/build/./gcc/xgcc -B/var/tmp/portage/sys-devel/gcc-9.2.0-r2/work/build/./gcc/ -print-sysroot-headers-suffix > /dev/null 2>&1; then \
25 set -e; for ml in `/var/tmp/portage/sys-devel/gcc-9.2.0-r2/work/build/./gcc/xgcc -B/var/tmp/portage/sys-devel/gcc-9.2.0-r2/work/build/./gcc/ -print-multi-lib`; do \
26 multi_dir=`echo ${ml} | sed -e 's/;.*$//'`; \
27 flags=`echo ${ml} | sed -e 's/^[^;]*;//' -e 's/@/ -/g'`; \
28 sfx=`/var/tmp/portage/sys-devel/gcc-9.2.0-r2/work/build/./gcc/xgcc -B/var/tmp/portage/sys-devel/gcc-9.2.0-r2/work/build/./gcc/ ${flags} -print-sysroot-headers-suffix`; \
29 if [ "${multi_dir}" = "." ]; \
30 then multi_dir=""; \
31 else \
32 multi_dir=/${multi_dir}; \
33 fi; \
34 echo "${sfx};${multi_dir}"; \
35 done; \
36 else \
37 echo ";"; \
38 fi > tmp-fixinc_list
39 /bin/bash /var/tmp/portage/sys-devel/gcc-9.2.0-r2/work/gcc-9.2.0/gcc/../move-if-change tmp-fixinc_list fixinc_list
40 echo timestamp > s-fixinc_list
41 : > tmp-libgcc.mvars
42 echo GCC_CFLAGS = '-g -O2 -pipe -DIN_GCC -W -Wall -Wno-narrowing -Wwrite-strings -Wcast-qual -Wstrict-prototypes -Wmissing-prototypes -Wold-style-definition -isystem ./include ' >> tmp-libgcc.mvars
43 echo INHIBIT_LIBC_CFLAGS = '' >> tmp-libgcc.mvars
44 echo TARGET_SYSTEM_ROOT = '' >> tmp-libgcc.mvars
45 if test yes = yes; then \
46 NO_PIE_CFLAGS="-fno-PIE"; \
47 else \
48 NO_PIE_CFLAGS=; \
49 fi; \
50 echo NO_PIE_CFLAGS = "$NO_PIE_CFLAGS" >> tmp-libgcc.mvars
51 mv tmp-libgcc.mvars libgcc.mvars
52 /var/tmp/portage/sys-devel/gcc-9.2.0-r2/work/build/./prev-gcc/xg++ -B/var/tmp/portage/sys-devel/gcc-9.2.0-r2/work/build/./prev-gcc/ -B/usr/x86_64-pc-linux-gnu/bin/ -nostdinc++ -B/var/tmp/portage/sys-devel/gcc-9.2.0-r2/work/build/prev-x86_64-pc-linux-gnu/libstdc++-v3/src/.libs -B/var/tmp/portage/sys-devel/gcc-9.2.0-r2/work/build/prev-x86_64-pc-linux-gnu/libstdc++-v3/libsupc++/.libs -isystem /var/tmp/portage/sys-devel/gcc-9.2.0-r2/work/build/prev-x86_64-pc-linux-gnu/libstdc++-v3/include/x86_64-pc-linux-gnu -isystem /var/tmp/portage/sys-devel/gcc-9.2.0-r2/work/build/prev-x86_64-pc-linux-gnu/libstdc++-v3/include -isystem /var/tmp/portage/sys-devel/gcc-9.2.0-r2/work/gcc-9.2.0/libstdc++-v3/libsupc++ -L/var/tmp/portage/sys-devel/gcc-9.2.0-r2/work/build/prev-x86_64-pc-linux-gnu/libstdc++-v3/src/.libs -L/var/tmp/portage/sys-devel/gcc-9.2.0-r2/work/build/prev-x86_64-pc-linux-gnu/libstdc++-v3/libsupc++/.libs -no-pie -fno-PIE -m64 -O2 -pipe -fno-checking -gtoggle -DIN_GCC -fno-exceptio
53 ns -fno-rtti -fasynchronous-unwind-tables -W -Wall -Wno-narrowing -Wwrite-strings -Wcast-qual -Wmissing-format-attribute -Woverloaded-virtual -pedantic -Wno-long-long -Wno-variadic-macros -Wno-overlength-strings -DHAVE_CONFIG_H -static-libstdc++ -static-libgcc gcov-dump.o \
54 hash-table.o ggc-none.o\
55 libcommon.a ../libcpp/libcpp.a ../libbacktrace/.libs/libbacktrace.a ../libiberty/libiberty.a ../libdecnumber/libdecnumber.a -o gcov-dump
56 /var/tmp/portage/sys-devel/gcc-9.2.0-r2/work/build/./prev-gcc/xg++ -B/var/tmp/portage/sys-devel/gcc-9.2.0-r2/work/build/./prev-gcc/ -B/usr/x86_64-pc-linux-gnu/bin/ -nostdinc++ -B/var/tmp/portage/sys-devel/gcc-9.2.0-r2/work/build/prev-x86_64-pc-linux-gnu/libstdc++-v3/src/.libs -B/var/tmp/portage/sys-devel/gcc-9.2.0-r2/work/build/prev-x86_64-pc-linux-gnu/libstdc++-v3/libsupc++/.libs -isystem /var/tmp/portage/sys-devel/gcc-9.2.0-r2/work/build/prev-x86_64-pc-linux-gnu/libstdc++-v3/include/x86_64-pc-linux-gnu -isystem /var/tmp/portage/sys-devel/gcc-9.2.0-r2/work/build/prev-x86_64-pc-linux-gnu/libstdc++-v3/include -isystem /var/tmp/portage/sys-devel/gcc-9.2.0-r2/work/gcc-9.2.0/libstdc++-v3/libsupc++ -L/var/tmp/portage/sys-devel/gcc-9.2.0-r2/work/build/prev-x86_64-pc-linux-gnu/libstdc++-v3/src/.libs -L/var/tmp/portage/sys-devel/gcc-9.2.0-r2/work/build/prev-x86_64-pc-linux-gnu/libstdc++-v3/libsupc++/.libs -no-pie -fno-PIE -m64 -O2 -pipe -fno-checking -gtoggle -DIN_GCC -fno-exceptio
57 ns -fno-rtti -fasynchronous-unwind-tables -W -Wall -Wno-narrowing -Wwrite-strings -Wcast-qual -Wmissing-format-attribute -Woverloaded-virtual -pedantic -Wno-long-long -Wno-variadic-macros -Wno-overlength-strings -DHAVE_CONFIG_H -static-libstdc++ -static-libgcc gcov.o json.o \
58 hash-table.o ggc-none.o libcommon.a ../libcpp/libcpp.a ../libbacktrace/.libs/libbacktrace.a ../libiberty/libiberty.a ../libdecnumber/libdecnumber.a -lz -o gcov
59 /var/tmp/portage/sys-devel/gcc-9.2.0-r2/work/build/./prev-gcc/xg++ -B/var/tmp/portage/sys-devel/gcc-9.2.0-r2/work/build/./prev-gcc/ -B/usr/x86_64-pc-linux-gnu/bin/ -nostdinc++ -B/var/tmp/portage/sys-devel/gcc-9.2.0-r2/work/build/prev-x86_64-pc-linux-gnu/libstdc++-v3/src/.libs -B/var/tmp/portage/sys-devel/gcc-9.2.0-r2/work/build/prev-x86_64-pc-linux-gnu/libstdc++-v3/libsupc++/.libs -isystem /var/tmp/portage/sys-devel/gcc-9.2.0-r2/work/build/prev-x86_64-pc-linux-gnu/libstdc++-v3/include/x86_64-pc-linux-gnu -isystem /var/tmp/portage/sys-devel/gcc-9.2.0-r2/work/build/prev-x86_64-pc-linux-gnu/libstdc++-v3/include -isystem /var/tmp/portage/sys-devel/gcc-9.2.0-r2/work/gcc-9.2.0/libstdc++-v3/libsupc++ -L/var/tmp/portage/sys-devel/gcc-9.2.0-r2/work/build/prev-x86_64-pc-linux-gnu/libstdc++-v3/src/.libs -L/var/tmp/portage/sys-devel/gcc-9.2.0-r2/work/build/prev-x86_64-pc-linux-gnu/libstdc++-v3/libsupc++/.libs -fno-PIE -c -fno-PIE -DIN_GCC_FRONTEND -m64 -O2 -pipe -fno-checking -gtoggle -DIN_
60 GCC -fno-exceptions -fno-rtti -fasynchronous-unwind-tables -W -Wall -Wno-narrowing -Wwrite-strings -Wcast-qual -Wmissing-format-attribute -Woverloaded-virtual -pedantic -Wno-long-long -Wno-variadic-macros -Wno-overlength-strings -DHAVE_CONFIG_H -I. -Ilto -I/var/tmp/portage/sys-devel/gcc-9.2.0-r2/work/gcc-9.2.0/gcc -I/var/tmp/portage/sys-devel/gcc-9.2.0-r2/work/gcc-9.2.0/gcc/lto -I/var/tmp/portage/sys-devel/gcc-9.2.0-r2/work/gcc-9.2.0/gcc/../include -I/var/tmp/portage/sys-devel/gcc-9.2.0-r2/work/gcc-9.2.0/gcc/../libcpp/include -I/var/tmp/portage/sys-devel/gcc-9.2.0-r2/work/gcc-9.2.0/gcc/../libdecnumber -I/var/tmp/portage/sys-devel/gcc-9.2.0-r2/work/gcc-9.2.0/gcc/../libdecnumber/bid -I../libdecnumber -I/var/tmp/portage/sys-devel/gcc-9.2.0-r2/work/gcc-9.2.0/gcc/../libbacktrace -o lto/lto-lang.o -MT lto/lto-lang.o -MMD -MP -MF lto/.deps/lto-lang.TPo /var/tmp/portage/sys-devel/gcc-9.2.0-r2/work/gcc-9.2.0/gcc/lto/lto-lang.c
61 /var/tmp/portage/sys-devel/gcc-9.2.0-r2/work/build/./prev-gcc/xg++ -B/var/tmp/portage/sys-devel/gcc-9.2.0-r2/work/build/./prev-gcc/ -B/usr/x86_64-pc-linux-gnu/bin/ -nostdinc++ -B/var/tmp/portage/sys-devel/gcc-9.2.0-r2/work/build/prev-x86_64-pc-linux-gnu/libstdc++-v3/src/.libs -B/var/tmp/portage/sys-devel/gcc-9.2.0-r2/work/build/prev-x86_64-pc-linux-gnu/libstdc++-v3/libsupc++/.libs -isystem /var/tmp/portage/sys-devel/gcc-9.2.0-r2/work/build/prev-x86_64-pc-linux-gnu/libstdc++-v3/include/x86_64-pc-linux-gnu -isystem /var/tmp/portage/sys-devel/gcc-9.2.0-r2/work/build/prev-x86_64-pc-linux-gnu/libstdc++-v3/include -isystem /var/tmp/portage/sys-devel/gcc-9.2.0-r2/work/gcc-9.2.0/libstdc++-v3/libsupc++ -L/var/tmp/portage/sys-devel/gcc-9.2.0-r2/work/build/prev-x86_64-pc-linux-gnu/libstdc++-v3/src/.libs -L/var/tmp/portage/sys-devel/gcc-9.2.0-r2/work/build/prev-x86_64-pc-linux-gnu/libstdc++-v3/libsupc++/.libs -fno-PIE -c -fno-PIE -DIN_GCC_FRONTEND -m64 -O2 -pipe -fno-checking -gtoggle -DIN_
62 GCC -fno-exceptions -fno-rtti -fasynchronous-unwind-tables -W -Wall -Wno-narrowing -Wwrite-strings -Wcast-qual -Wmissing-format-attribute -Woverloaded-virtual -pedantic -Wno-long-long -Wno-variadic-macros -Wno-overlength-strings -DHAVE_CONFIG_H -I. -Icp -I/var/tmp/portage/sys-devel/gcc-9.2.0-r2/work/gcc-9.2.0/gcc -I/var/tmp/portage/sys-devel/gcc-9.2.0-r2/work/gcc-9.2.0/gcc/cp -I/var/tmp/portage/sys-devel/gcc-9.2.0-r2/work/gcc-9.2.0/gcc/../include -I/var/tmp/portage/sys-devel/gcc-9.2.0-r2/work/gcc-9.2.0/gcc/../libcpp/include -I/var/tmp/portage/sys-devel/gcc-9.2.0-r2/work/gcc-9.2.0/gcc/../libdecnumber -I/var/tmp/portage/sys-devel/gcc-9.2.0-r2/work/gcc-9.2.0/gcc/../libdecnumber/bid -I../libdecnumber -I/var/tmp/portage/sys-devel/gcc-9.2.0-r2/work/gcc-9.2.0/gcc/../libbacktrace -o cp/typeck.o -MT cp/typeck.o -MMD -MP -MF cp/.deps/typeck.TPo /var/tmp/portage/sys-devel/gcc-9.2.0-r2/work/gcc-9.2.0/gcc/cp/typeck.c
63 rm -rf libbackend.a
64 x86_64-pc-linux-gnu-ar rcT libbackend.a gimple-match.o generic-match.o insn-attrtab.o insn-automata.o insn-dfatab.o insn-emit.o insn-extract.o insn-latencytab.o insn-modes.o insn-opinit.o insn-output.o insn-peep.o insn-preds.o insn-recog.o insn-enums.o ggc-page.o alias.o alloc-pool.o auto-inc-dec.o auto-profile.o bb-reorder.o bitmap.o bt-load.o builtins.o caller-save.o calls.o ccmp.o cfg.o cfganal.o cfgbuild.o cfgcleanup.o cfgexpand.o cfghooks.o cfgloop.o cfgloopanal.o cfgloopmanip.o cfgrtl.o symtab.o cgraph.o cgraphbuild.o cgraphunit.o cgraphclones.o combine.o combine-stack-adj.o compare-elim.o context.o convert.o coverage.o cppbuiltin.o cppdefault.o cprop.o cse.o cselib.o data-streamer.o data-streamer-in.o data-streamer-out.o dbxout.o dbgcnt.o dce.o ddg.o debug.o df-core.o df-problems.o df-scan.o dfp.o dojump.o dominance.o domwalk.o double-int.o dse.o dumpfile.o dwarf2asm.o dwarf2cfi.o dwarf2out.o early-remat.o emit-rtl.o et-forest.o except.o explow.o expmed.o expr.o fibonacci_heap
65 .o file-prefix-map.o final.o fixed-value.o fold-const.o fold-const-call.o function.o function-tests.o fwprop.o gcc-rich-location.o gcse.o gcse-common.o ggc-common.o ggc-tests.o gimple.o gimple-builder.o gimple-expr.o gimple-iterator.o gimple-fold.o gimple-laddress.o gimple-loop-interchange.o gimple-loop-jam.o gimple-loop-versioning.o gimple-low.o gimple-pretty-print.o gimple-ssa-backprop.o gimple-ssa-evrp.o gimple-ssa-evrp-analyze.o gimple-ssa-isolate-paths.o gimple-ssa-nonnull-compare.o gimple-ssa-split-paths.o gimple-ssa-store-merging.o gimple-ssa-strength-reduction.o gimple-ssa-sprintf.o gimple-ssa-warn-alloca.o gimple-ssa-warn-restrict.o gimple-streamer-in.o gimple-streamer-out.o gimple-walk.o gimplify.o gimplify-me.o godump.o graph.o graphds.o graphite.o graphite-isl-ast-to-gimple.o graphite-dependences.o graphite-optimize-isl.o graphite-poly.o graphite-scop-detection.o graphite-sese-to-poly.o gtype-desc.o haifa-sched.o hash-map-tests.o hash-set-tests.o hsa-common.o hsa-gen.o h
66 sa-regalloc.o hsa-brig.o hsa-dump.o hw-doloop.o hwint.o ifcvt.o ree.o inchash.o incpath.o init-regs.o internal-fn.o ipa-cp.o ipa-devirt.o ipa-fnsummary.o ipa-polymorphic-call.o ipa-split.o ipa-inline.o ipa-comdats.o ipa-visibility.o ipa-inline-analysis.o ipa-inline-transform.o ipa-predicate.o ipa-profile.o ipa-prop.o ipa-param-manipulation.o ipa-pure-const.o ipa-icf.o ipa-icf-gimple.o ipa-reference.o ipa-hsa.o ipa-ref.o ipa-utils.o ipa.o ira.o ira-build.o ira-costs.o ira-conflicts.o ira-color.o ira-emit.o ira-lives.o jump.o langhooks.o lcm.o lists.o loop-doloop.o loop-init.o loop-invariant.o loop-iv.o loop-unroll.o lower-subreg.o lra.o lra-assigns.o lra-coalesce.o lra-constraints.o lra-eliminations.o lra-lives.o lra-remat.o lra-spills.o lto-cgraph.o lto-streamer.o lto-streamer-in.o lto-streamer-out.o lto-section-in.o lto-section-out.o lto-opts.o lto-compress.o mcf.o mode-switching.o modulo-sched.o multiple_target.o omp-offload.o omp-expand.o omp-general.o omp-grid.o omp-low.o omp-si
67 md-clone.o opt-problem.o optabs.o optabs-libfuncs.o optabs-query.o optabs-tree.o optinfo.o optinfo-emit-json.o options-save.o opts-global.o passes.o plugin.o postreload-gcse.o postreload.o predict.o print-rtl.o print-rtl-function.o print-tree.o profile.o profile-count.o read-md.o read-rtl.o read-rtl-function.o real.o realmpfr.o recog.o reg-stack.o regcprop.o reginfo.o regrename.o regstat.o reload.o reload1.o reorg.o resource.o rtl-error.o rtl-tests.o rtl.o rtlhash.o rtlanal.o rtlhooks.o rtx-vector-builder.o run-rtl-passes.o sched-deps.o sched-ebb.o sched-rgn.o sel-sched-ir.o sel-sched-dump.o sel-sched.o selftest-rtl.o selftest-run-tests.o sese.o shrink-wrap.o simplify-rtx.o sparseset.o spellcheck.o spellcheck-tree.o sreal.o stack-ptr-mod.o statistics.o stmt.o stor-layout.o store-motion.o streamer-hooks.o stringpool.o substring-locations.o target-globals.o targhooks.o timevar.o toplev.o tracer.o trans-mem.o tree-affine.o asan.o tsan.o ubsan.o sanopt.o sancov.o tree-call-cdce.o tree-c
68 fg.o tree-cfgcleanup.o tree-chrec.o tree-complex.o tree-data-ref.o tree-dfa.o tree-diagnostic.o tree-dump.o tree-eh.o tree-emutls.o tree-if-conv.o tree-inline.o tree-into-ssa.o tree-iterator.o tree-loop-distribution.o tree-nested.o tree-nrv.o tree-object-size.o tree-outof-ssa.o tree-parloops.o tree-phinodes.o tree-predcom.o tree-pretty-print.o tree-profile.o tree-scalar-evolution.o tree-sra.o tree-switch-conversion.o tree-ssa-address.o tree-ssa-alias.o tree-ssa-ccp.o tree-ssa-coalesce.o tree-ssa-copy.o tree-ssa-dce.o tree-ssa-dom.o tree-ssa-dse.o tree-ssa-forwprop.o tree-ssa-ifcombine.o tree-ssa-live.o tree-ssa-loop-ch.o tree-ssa-loop-im.o tree-ssa-loop-ivcanon.o tree-ssa-loop-ivopts.o tree-ssa-loop-manip.o tree-ssa-loop-niter.o tree-ssa-loop-prefetch.o tree-ssa-loop-split.o tree-ssa-loop-unswitch.o tree-ssa-loop.o tree-ssa-math-opts.o tree-ssa-operands.o tree-ssa-phiopt.o tree-ssa-phiprop.o tree-ssa-pre.o tree-ssa-propagate.o tree-ssa-reassoc.o tree-ssa-sccvn.o tree-ssa-scopedtable
69 s.o tree-ssa-sink.o tree-ssa-strlen.o tree-ssa-structalias.o tree-ssa-tail-merge.o tree-ssa-ter.o tree-ssa-threadbackward.o tree-ssa-threadedge.o tree-ssa-threadupdate.o tree-ssa-uncprop.o tree-ssa-uninit.o tree-ssa.o tree-ssanames.o tree-stdarg.o tree-streamer.o tree-streamer-in.o tree-streamer-out.o tree-tailcall.o tree-vect-generic.o tree-vect-patterns.o tree-vect-data-refs.o tree-vect-stmts.o tree-vect-loop.o tree-vect-loop-manip.o tree-vect-slp.o tree-vectorizer.o tree-vector-builder.o tree-vrp.o tree.o typed-splay-tree.o unique-ptr-tests.o valtrack.o value-prof.o var-tracking.o varasm.o varpool.o vec-perm-indices.o vmsdbgout.o vr-values.o vtable-verify.o web.o wide-int.o wide-int-print.o wide-int-range.o xcoffout.o i386.o x86-tune-sched.o x86-tune-sched-bd.o x86-tune-sched-atom.o x86-tune-sched-core.o linux.o cet.o host-linux.o
70 if [ -f ../stage_final ] \
71 && cmp -s ../stage_current ../stage_final; then \
72 cp ../prev-gcc/cc1-checksum.c cc1-checksum.c; \
73 else \
74 build/genchecksum c/c-lang.o c-family/stub-objc.o attribs.o c/c-errors.o c/c-decl.o c/c-typeck.o c/c-convert.o c/c-aux-info.o c/c-objc-common.o c/c-parser.o c/c-fold.o c/gimple-parser.o c-family/c-common.o c-family/c-cppbuiltin.o c-family/c-dump.o c-family/c-format.o c-family/c-gimplify.o c-family/c-indentation.o c-family/c-lex.o c-family/c-omp.o c-family/c-opts.o c-family/c-pch.o c-family/c-ppoutput.o c-family/c-pragma.o c-family/c-pretty-print.o c-family/c-semantics.o c-family/c-ada-spec.o c-family/c-ubsan.o c-family/known-headers.o c-family/c-attribs.o c-family/c-warn.o c-family/c-spellcheck.o i386-c.o glibc-c.o libbackend.a main.o libcommon-target.a libcommon.a ../libcpp/libcpp.a ../libdecnumber/libdecnumber.a libcommon.a ../libcpp/libcpp.a ../libiberty/libiberty.a ../libdecnumber/libdecnumber.a ../libbacktrace/.libs/libbacktrace.a \
75 checksum-options > cc1-checksum.c.tmp && \
76 /var/tmp/portage/sys-devel/gcc-9.2.0-r2/work/gcc-9.2.0/gcc/../move-if-change cc1-checksum.c.tmp cc1-checksum.c; \
77 fi
78 /var/tmp/portage/sys-devel/gcc-9.2.0-r2/work/build/./prev-gcc/xg++ -B/var/tmp/portage/sys-devel/gcc-9.2.0-r2/work/build/./prev-gcc/ -B/usr/x86_64-pc-linux-gnu/bin/ -nostdinc++ -B/var/tmp/portage/sys-devel/gcc-9.2.0-r2/work/build/prev-x86_64-pc-linux-gnu/libstdc++-v3/src/.libs -B/var/tmp/portage/sys-devel/gcc-9.2.0-r2/work/build/prev-x86_64-pc-linux-gnu/libstdc++-v3/libsupc++/.libs -isystem /var/tmp/portage/sys-devel/gcc-9.2.0-r2/work/build/prev-x86_64-pc-linux-gnu/libstdc++-v3/include/x86_64-pc-linux-gnu -isystem /var/tmp/portage/sys-devel/gcc-9.2.0-r2/work/build/prev-x86_64-pc-linux-gnu/libstdc++-v3/include -isystem /var/tmp/portage/sys-devel/gcc-9.2.0-r2/work/gcc-9.2.0/libstdc++-v3/libsupc++ -L/var/tmp/portage/sys-devel/gcc-9.2.0-r2/work/build/prev-x86_64-pc-linux-gnu/libstdc++-v3/src/.libs -L/var/tmp/portage/sys-devel/gcc-9.2.0-r2/work/build/prev-x86_64-pc-linux-gnu/libstdc++-v3/libsupc++/.libs -fno-PIE -c -fno-PIE -DIN_GCC_FRONTEND -m64 -O2 -pipe -fno-checking -gtoggle -DIN_
79 GCC -fno-exceptions -fno-rtti -fasynchronous-unwind-tables -W -Wall -Wno-narrowing -Wwrite-strings -Wcast-qual -Wmissing-format-attribute -Woverloaded-virtual -pedantic -Wno-long-long -Wno-variadic-macros -Wno-overlength-strings -DHAVE_CONFIG_H -I. -I. -I/var/tmp/portage/sys-devel/gcc-9.2.0-r2/work/gcc-9.2.0/gcc -I/var/tmp/portage/sys-devel/gcc-9.2.0-r2/work/gcc-9.2.0/gcc/. -I/var/tmp/portage/sys-devel/gcc-9.2.0-r2/work/gcc-9.2.0/gcc/../include -I/var/tmp/portage/sys-devel/gcc-9.2.0-r2/work/gcc-9.2.0/gcc/../libcpp/include -I/var/tmp/portage/sys-devel/gcc-9.2.0-r2/work/gcc-9.2.0/gcc/../libdecnumber -I/var/tmp/portage/sys-devel/gcc-9.2.0-r2/work/gcc-9.2.0/gcc/../libdecnumber/bid -I../libdecnumber -I/var/tmp/portage/sys-devel/gcc-9.2.0-r2/work/gcc-9.2.0/gcc/../libbacktrace -o cc1-checksum.o -MT cc1-checksum.o -MMD -MP -MF ./.deps/cc1-checksum.TPo cc1-checksum.c
80 /var/tmp/portage/sys-devel/gcc-9.2.0-r2/work/build/./prev-gcc/xg++ -B/var/tmp/portage/sys-devel/gcc-9.2.0-r2/work/build/./prev-gcc/ -B/usr/x86_64-pc-linux-gnu/bin/ -nostdinc++ -B/var/tmp/portage/sys-devel/gcc-9.2.0-r2/work/build/prev-x86_64-pc-linux-gnu/libstdc++-v3/src/.libs -B/var/tmp/portage/sys-devel/gcc-9.2.0-r2/work/build/prev-x86_64-pc-linux-gnu/libstdc++-v3/libsupc++/.libs -isystem /var/tmp/portage/sys-devel/gcc-9.2.0-r2/work/build/prev-x86_64-pc-linux-gnu/libstdc++-v3/include/x86_64-pc-linux-gnu -isystem /var/tmp/portage/sys-devel/gcc-9.2.0-r2/work/build/prev-x86_64-pc-linux-gnu/libstdc++-v3/include -isystem /var/tmp/portage/sys-devel/gcc-9.2.0-r2/work/gcc-9.2.0/libstdc++-v3/libsupc++ -L/var/tmp/portage/sys-devel/gcc-9.2.0-r2/work/build/prev-x86_64-pc-linux-gnu/libstdc++-v3/src/.libs -L/var/tmp/portage/sys-devel/gcc-9.2.0-r2/work/build/prev-x86_64-pc-linux-gnu/libstdc++-v3/libsupc++/.libs -no-pie -fno-PIE -m64 -O2 -pipe -fno-checking -gtoggle -DIN_GCC -fno-exceptio
81 ns -fno-rtti -fasynchronous-unwind-tables -W -Wall -Wno-narrowing -Wwrite-strings -Wcast-qual -Wmissing-format-attribute -Woverloaded-virtual -pedantic -Wno-long-long -Wno-variadic-macros -Wno-overlength-strings -DHAVE_CONFIG_H -static-libstdc++ -static-libgcc -o cc1 c/c-lang.o c-family/stub-objc.o attribs.o c/c-errors.o c/c-decl.o c/c-typeck.o c/c-convert.o c/c-aux-info.o c/c-objc-common.o c/c-parser.o c/c-fold.o c/gimple-parser.o c-family/c-common.o c-family/c-cppbuiltin.o c-family/c-dump.o c-family/c-format.o c-family/c-gimplify.o c-family/c-indentation.o c-family/c-lex.o c-family/c-omp.o c-family/c-opts.o c-family/c-pch.o c-family/c-ppoutput.o c-family/c-pragma.o c-family/c-pretty-print.o c-family/c-semantics.o c-family/c-ada-spec.o c-family/c-ubsan.o c-family/known-headers.o c-family/c-attribs.o c-family/c-warn.o c-family/c-spellcheck.o i386-c.o glibc-c.o \
82 cc1-checksum.o libbackend.a main.o libcommon-target.a libcommon.a ../libcpp/libcpp.a ../libdecnumber/libdecnumber.a libcommon.a ../libcpp/libcpp.a ../libbacktrace/.libs/libbacktrace.a ../libiberty/libiberty.a ../libdecnumber/libdecnumber.a -lmpc -lmpfr -lgmp -rdynamic -ldl -lz
83 /var/tmp/portage/sys-devel/gcc-9.2.0-r2/work/build/./prev-gcc/xg++ -B/var/tmp/portage/sys-devel/gcc-9.2.0-r2/work/build/./prev-gcc/ -B/usr/x86_64-pc-linux-gnu/bin/ -nostdinc++ -B/var/tmp/portage/sys-devel/gcc-9.2.0-r2/work/build/prev-x86_64-pc-linux-gnu/libstdc++-v3/src/.libs -B/var/tmp/portage/sys-devel/gcc-9.2.0-r2/work/build/prev-x86_64-pc-linux-gnu/libstdc++-v3/libsupc++/.libs -isystem /var/tmp/portage/sys-devel/gcc-9.2.0-r2/work/build/prev-x86_64-pc-linux-gnu/libstdc++-v3/include/x86_64-pc-linux-gnu -isystem /var/tmp/portage/sys-devel/gcc-9.2.0-r2/work/build/prev-x86_64-pc-linux-gnu/libstdc++-v3/include -isystem /var/tmp/portage/sys-devel/gcc-9.2.0-r2/work/gcc-9.2.0/libstdc++-v3/libsupc++ -L/var/tmp/portage/sys-devel/gcc-9.2.0-r2/work/build/prev-x86_64-pc-linux-gnu/libstdc++-v3/src/.libs -L/var/tmp/portage/sys-devel/gcc-9.2.0-r2/work/build/prev-x86_64-pc-linux-gnu/libstdc++-v3/libsupc++/.libs -no-pie -fno-PIE -m64 -O2 -pipe -fno-checking -gtoggle -DIN_GCC -fno-exceptio
84 ns -fno-rtti -fasynchronous-unwind-tables -W -Wall -Wno-narrowing -Wwrite-strings -Wcast-qual -Wmissing-format-attribute -Woverloaded-virtual -pedantic -Wno-long-long -Wno-variadic-macros -Wno-overlength-strings -DHAVE_CONFIG_H -static-libstdc++ -static-libgcc -o lto1 \
85 lto/lto-lang.o lto/lto.o lto/lto-object.o attribs.o lto/lto-partition.o lto/lto-symtab.o libbackend.a main.o libcommon-target.a libcommon.a ../libcpp/libcpp.a ../libdecnumber/libdecnumber.a -lmpc -lmpfr -lgmp -rdynamic -ldl -lz libcommon.a ../libcpp/libcpp.a ../libbacktrace/.libs/libbacktrace.a ../libiberty/libiberty.a ../libdecnumber/libdecnumber.a
86 if [ -f ../stage_final ] \
87 && cmp -s ../stage_current ../stage_final; then \
88 cp ../prev-gcc/cc1plus-checksum.c cc1plus-checksum.c; \
89 else \
90 build/genchecksum cp/cp-lang.o c-family/stub-objc.o cp/call.o cp/class.o cp/constexpr.o cp/constraint.o cp/cp-gimplify.o cp/cp-objcp-common.o cp/cp-ubsan.o cp/cvt.o cp/cxx-pretty-print.o cp/decl.o cp/decl2.o cp/dump.o cp/error.o cp/except.o cp/expr.o cp/friend.o cp/init.o cp/lambda.o cp/lex.o cp/logic.o cp/mangle.o cp/method.o cp/name-lookup.o cp/optimize.o cp/parser.o cp/pt.o cp/ptree.o cp/repo.o cp/rtti.o cp/search.o cp/semantics.o cp/tree.o cp/typeck.o cp/typeck2.o cp/vtable-class-hierarchy.o attribs.o incpath.o c-family/c-common.o c-family/c-cppbuiltin.o c-family/c-dump.o c-family/c-format.o c-family/c-gimplify.o c-family/c-indentation.o c-family/c-lex.o c-family/c-omp.o c-family/c-opts.o c-family/c-pch.o c-family/c-ppoutput.o c-family/c-pragma.o c-family/c-pretty-print.o c-family/c-semantics.o c-family/c-ada-spec.o c-family/c-ubsan.o c-family/known-headers.o c-family/c-attribs.o c-family/c-warn.o c-family/c-spellcheck.o i386-c.o glibc-c.o libbackend.a main.o libcommon-target.a
91 libcommon.a ../libcpp/libcpp.a ../libdecnumber/libdecnumber.a libcommon.a ../libcpp/libcpp.a ../libiberty/libiberty.a ../libdecnumber/libdecnumber.a ../libbacktrace/.libs/libbacktrace.a \
92 checksum-options > cc1plus-checksum.c.tmp && \
93 /var/tmp/portage/sys-devel/gcc-9.2.0-r2/work/gcc-9.2.0/gcc/../move-if-change cc1plus-checksum.c.tmp cc1plus-checksum.c; \
94 fi
95 /var/tmp/portage/sys-devel/gcc-9.2.0-r2/work/build/./prev-gcc/xg++ -B/var/tmp/portage/sys-devel/gcc-9.2.0-r2/work/build/./prev-gcc/ -B/usr/x86_64-pc-linux-gnu/bin/ -nostdinc++ -B/var/tmp/portage/sys-devel/gcc-9.2.0-r2/work/build/prev-x86_64-pc-linux-gnu/libstdc++-v3/src/.libs -B/var/tmp/portage/sys-devel/gcc-9.2.0-r2/work/build/prev-x86_64-pc-linux-gnu/libstdc++-v3/libsupc++/.libs -isystem /var/tmp/portage/sys-devel/gcc-9.2.0-r2/work/build/prev-x86_64-pc-linux-gnu/libstdc++-v3/include/x86_64-pc-linux-gnu -isystem /var/tmp/portage/sys-devel/gcc-9.2.0-r2/work/build/prev-x86_64-pc-linux-gnu/libstdc++-v3/include -isystem /var/tmp/portage/sys-devel/gcc-9.2.0-r2/work/gcc-9.2.0/libstdc++-v3/libsupc++ -L/var/tmp/portage/sys-devel/gcc-9.2.0-r2/work/build/prev-x86_64-pc-linux-gnu/libstdc++-v3/src/.libs -L/var/tmp/portage/sys-devel/gcc-9.2.0-r2/work/build/prev-x86_64-pc-linux-gnu/libstdc++-v3/libsupc++/.libs -fno-PIE -c -fno-PIE -DIN_GCC_FRONTEND -m64 -O2 -pipe -fno-checking -gtoggle -DIN_
96 GCC -fno-exceptions -fno-rtti -fasynchronous-unwind-tables -W -Wall -Wno-narrowing -Wwrite-strings -Wcast-qual -Wmissing-format-attribute -Woverloaded-virtual -pedantic -Wno-long-long -Wno-variadic-macros -Wno-overlength-strings -DHAVE_CONFIG_H -I. -I. -I/var/tmp/portage/sys-devel/gcc-9.2.0-r2/work/gcc-9.2.0/gcc -I/var/tmp/portage/sys-devel/gcc-9.2.0-r2/work/gcc-9.2.0/gcc/. -I/var/tmp/portage/sys-devel/gcc-9.2.0-r2/work/gcc-9.2.0/gcc/../include -I/var/tmp/portage/sys-devel/gcc-9.2.0-r2/work/gcc-9.2.0/gcc/../libcpp/include -I/var/tmp/portage/sys-devel/gcc-9.2.0-r2/work/gcc-9.2.0/gcc/../libdecnumber -I/var/tmp/portage/sys-devel/gcc-9.2.0-r2/work/gcc-9.2.0/gcc/../libdecnumber/bid -I../libdecnumber -I/var/tmp/portage/sys-devel/gcc-9.2.0-r2/work/gcc-9.2.0/gcc/../libbacktrace -o cc1plus-checksum.o -MT cc1plus-checksum.o -MMD -MP -MF ./.deps/cc1plus-checksum.TPo cc1plus-checksum.c
97 /var/tmp/portage/sys-devel/gcc-9.2.0-r2/work/build/./prev-gcc/xg++ -B/var/tmp/portage/sys-devel/gcc-9.2.0-r2/work/build/./prev-gcc/ -B/usr/x86_64-pc-linux-gnu/bin/ -nostdinc++ -B/var/tmp/portage/sys-devel/gcc-9.2.0-r2/work/build/prev-x86_64-pc-linux-gnu/libstdc++-v3/src/.libs -B/var/tmp/portage/sys-devel/gcc-9.2.0-r2/work/build/prev-x86_64-pc-linux-gnu/libstdc++-v3/libsupc++/.libs -isystem /var/tmp/portage/sys-devel/gcc-9.2.0-r2/work/build/prev-x86_64-pc-linux-gnu/libstdc++-v3/include/x86_64-pc-linux-gnu -isystem /var/tmp/portage/sys-devel/gcc-9.2.0-r2/work/build/prev-x86_64-pc-linux-gnu/libstdc++-v3/include -isystem /var/tmp/portage/sys-devel/gcc-9.2.0-r2/work/gcc-9.2.0/libstdc++-v3/libsupc++ -L/var/tmp/portage/sys-devel/gcc-9.2.0-r2/work/build/prev-x86_64-pc-linux-gnu/libstdc++-v3/src/.libs -L/var/tmp/portage/sys-devel/gcc-9.2.0-r2/work/build/prev-x86_64-pc-linux-gnu/libstdc++-v3/libsupc++/.libs -no-pie -fno-PIE -m64 -O2 -pipe -fno-checking -gtoggle -DIN_GCC -fno-exceptio
98 ns -fno-rtti -fasynchronous-unwind-tables -W -Wall -Wno-narrowing -Wwrite-strings -Wcast-qual -Wmissing-format-attribute -Woverloaded-virtual -pedantic -Wno-long-long -Wno-variadic-macros -Wno-overlength-strings -DHAVE_CONFIG_H -static-libstdc++ -static-libgcc -o cc1plus \
99 cp/cp-lang.o c-family/stub-objc.o cp/call.o cp/class.o cp/constexpr.o cp/constraint.o cp/cp-gimplify.o cp/cp-objcp-common.o cp/cp-ubsan.o cp/cvt.o cp/cxx-pretty-print.o cp/decl.o cp/decl2.o cp/dump.o cp/error.o cp/except.o cp/expr.o cp/friend.o cp/init.o cp/lambda.o cp/lex.o cp/logic.o cp/mangle.o cp/method.o cp/name-lookup.o cp/optimize.o cp/parser.o cp/pt.o cp/ptree.o cp/repo.o cp/rtti.o cp/search.o cp/semantics.o cp/tree.o cp/typeck.o cp/typeck2.o cp/vtable-class-hierarchy.o attribs.o incpath.o c-family/c-common.o c-family/c-cppbuiltin.o c-family/c-dump.o c-family/c-format.o c-family/c-gimplify.o c-family/c-indentation.o c-family/c-lex.o c-family/c-omp.o c-family/c-opts.o c-family/c-pch.o c-family/c-ppoutput.o c-family/c-pragma.o c-family/c-pretty-print.o c-family/c-semantics.o c-family/c-ada-spec.o c-family/c-ubsan.o c-family/known-headers.o c-family/c-attribs.o c-family/c-warn.o c-family/c-spellcheck.o i386-c.o glibc-c.o cc1plus-checksum.o libbackend.a main.o libcommon-tar
100 get.a libcommon.a ../libcpp/libcpp.a ../libdecnumber/libdecnumber.a libcommon.a ../libcpp/libcpp.a ../libbacktrace/.libs/libbacktrace.a ../libiberty/libiberty.a ../libdecnumber/libdecnumber.a -lmpc -lmpfr -lgmp -rdynamic -ldl -lz
101 collect2: error: ld returned 1 exit status
102 make[3]: *** [/var/tmp/portage/sys-devel/gcc-9.2.0-r2/work/gcc-9.2.0/gcc/cp/Make-lang.in:120: cc1plus] Error 1
103 make[3]: *** Waiting for unfinished jobs....
104 rm gcc.pod
105 make[3]: Leaving directory '/var/tmp/portage/sys-devel/gcc-9.2.0-r2/work/build/gcc'
106 make[2]: *** [Makefile:4705: all-stage2-gcc] Error 2
107 make[2]: Leaving directory '/var/tmp/portage/sys-devel/gcc-9.2.0-r2/work/build'
108 make[1]: *** [Makefile:19832: stage2-bubble] Error 2
109 make[1]: Leaving directory '/var/tmp/portage/sys-devel/gcc-9.2.0-r2/work/build'
110 make: *** [Makefile:20047: bootstrap-lean] Error 2
111 * ERROR: sys-devel/gcc-9.2.0-r2::gentoo failed (compile phase):
112 * emake failed
113 *
114 * If you need support, post the output of `emerge --info '=sys-devel/gcc-9.2.0-r2::gentoo'`,
115 * the complete build log and the output of `emerge -pqv '=sys-devel/gcc-9.2.0-r2::gentoo'`.
116 * The complete build log is located at '/var/tmp/portage/sys-devel/gcc-9.2.0-r2/temp/build.log'.
117 * The ebuild environment file is located at '/var/tmp/portage/sys-devel/gcc-9.2.0-r2/temp/environment'.
118 * Working directory: '/var/tmp/portage/sys-devel/gcc-9.2.0-r2/work/build'
119 * S: '/var/tmp/portage/sys-devel/gcc-9.2.0-r2/work/gcc-9.2.0'
120 *
121 * Please include /var/tmp/portage/sys-devel/gcc-9.2.0-r2/work/gcc-build-logs.tar.bz2 in your bug report.
122 *
123 * Messages for package sys-apps/portage-2.3.79 merged to /tmp/stage1root/:
124 * Unable to find kernel sources at /tmp/stage1root/usr/src/linux
125 * Unable to calculate Linux Kernel version for build, attempting to use running version
126 * Messages for package sys-apps/coreutils-8.30 merged to /tmp/stage1root/:
127 * Make sure you run 'hash -r' in your active shells.
128 * You should also re-source your shell settings for LS_COLORS
129 * changes, such as: source /etc/profile
130 * Messages for package sys-libs/timezone-data-2019c merged to /tmp/stage1root/:
131 * You do not have TIMEZONE set in /tmp/stage1root/etc/timezone.
132 * Setting /tmp/stage1root/etc/localtime to Factory.
133 * Messages for package sys-apps/util-linux-2.33.2 merged to /tmp/stage1root/:
134 * The mesg/wall/write tools have been disabled due to USE=-tty-helpers.
135 * The agetty util now clears the terminal by default. You
136 * might want to add --noclear to your /etc/inittab lines.
137 * Messages for package sys-apps/shadow-4.6 merged to /tmp/stage1root/:
138 * Running 'grpck' returned errors. Please run it by hand, and then
139 * run 'grpconv' afterwards!
140 * Messages for package sys-apps/baselayout-2.6-r1 merged to /tmp/stage1root/:
141 * You should reboot now to get /run mounted with tmpfs!
142 * Messages for package dev-libs/libxml2-2.9.9-r3 merged to /tmp/stage1root/:
143 * Skipping XML catalog creation for stage building (bug #208887).
144 * Messages for package dev-lang/python-3.6.9 merged to /tmp/stage1root/:
145 * You have just upgraded from an older version of Python.
146 *
147 * Please adjust PYTHON_TARGETS (if so desired), and run emerge with the --newuse or --changed-use option to rebuild packages installing python modules.
148 * Messages for package sys-devel/gcc-9.2.0-r2 merged to /tmp/stage1root/:
149 * ERROR: sys-devel/gcc-9.2.0-r2::gentoo failed (compile phase):
150 * emake failed
151 *
152 * If you need support, post the output of `emerge --info '=sys-devel/gcc-9.2.0-r2::gentoo'`,
153 * the complete build log and the output of `emerge -pqv '=sys-devel/gcc-9.2.0-r2::gentoo'`.
154 * The complete build log is located at '/var/tmp/portage/sys-devel/gcc-9.2.0-r2/temp/build.log'.
155 * The ebuild environment file is located at '/var/tmp/portage/sys-devel/gcc-9.2.0-r2/temp/environment'.
156 * Working directory: '/var/tmp/portage/sys-devel/gcc-9.2.0-r2/work/build'
157 * S: '/var/tmp/portage/sys-devel/gcc-9.2.0-r2/work/gcc-9.2.0'
158 *
159 * Please include /var/tmp/portage/sys-devel/gcc-9.2.0-r2/work/gcc-build-logs.tar.bz2 in your bug report.
160 *
161
162
163
164
165
166
167
168
169
170
171
172
173
174
175
176
177
178
179 20 Jan 2020 03:39:15 UTC: ERROR : CatalystError: cmd(['/usr/share/catalyst/targets/stage1/stage1-controller.sh', 'run']) exited 1
180 ERROR:catalyst:CatalystError: cmd(['/usr/share/catalyst/targets/stage1/stage1-controller.sh', 'run']) exited 1
181 20 Jan 2020 03:39:15 UTC: ERROR : CatalystError: Stage build aborting due to error.
182 ERROR:catalyst:CatalystError: Stage build aborting due to error.
183 20 Jan 2020 03:39:15 UTC: ERROR : Exception running action sequence run_local
184 Traceback (most recent call last):
185 File "/usr/lib64/python3.6/site-packages/catalyst/base/stagebase.py", line 1360, in run_local
186 env=self.env)
187 File "/usr/lib64/python3.6/site-packages/catalyst/support.py", line 54, in cmd
188 print_traceback=False)
189 catalyst.support.CatalystError: cmd(['/usr/share/catalyst/targets/stage1/stage1-controller.sh', 'run']) exited 1
190
191 During handling of the above exception, another exception occurred:
192
193 Traceback (most recent call last):
194 File "/usr/lib64/python3.6/site-packages/catalyst/base/stagebase.py", line 1465, in run
195 getattr(self, x)()
196 File "/usr/lib64/python3.6/site-packages/catalyst/base/stagebase.py", line 1369, in run_local
197 print_traceback=False)
198 catalyst.support.CatalystError: Stage build aborting due to error.
199 ERROR:catalyst:Exception running action sequence run_local
200 Traceback (most recent call last):
201 File "/usr/lib64/python3.6/site-packages/catalyst/base/stagebase.py", line 1360, in run_local
202 env=self.env)
203 File "/usr/lib64/python3.6/site-packages/catalyst/support.py", line 54, in cmd
204 print_traceback=False)
205 catalyst.support.CatalystError: cmd(['/usr/share/catalyst/targets/stage1/stage1-controller.sh', 'run']) exited 1
206
207 During handling of the above exception, another exception occurred:
208
209 Traceback (most recent call last):
210 File "/usr/lib64/python3.6/site-packages/catalyst/base/stagebase.py", line 1465, in run
211 getattr(self, x)()
212 File "/usr/lib64/python3.6/site-packages/catalyst/base/stagebase.py", line 1369, in run_local
213 print_traceback=False)
214 catalyst.support.CatalystError: Stage build aborting due to error.
215 20 Jan 2020 03:39:15 UTC: NOTICE : Cleaning up... Running unbind()
216 NOTICE:catalyst:Cleaning up... Running unbind()
217 Command exited with non-zero status 2
218 5702.16user 308.60system 38:36.25elapsed 259%CPU (0avgtext+0avgdata 832016maxresident)k
219 54200inputs+13506624outputs (0major+241792740minor)pagefaults 0swaps
220
221
222
223 Full build log at /home/release/tmp/run/catalyst-auto.20200120T030003Z.AL5B1Z/log/stage1.log