Gentoo Archives: gentoo-releng-autobuilds

From: catalyst@×××××××××××××××××××.name
To: jmbsvicetto@×××××.com, gentoo-releng-autobuilds@l.g.o
Subject: [gentoo-releng-autobuilds] [amd64-auto] Catalyst non-fatal build error - hardened/admincd-stage1.spec
Date: Mon, 04 Aug 2014 12:58:30
Message-Id: 20140804125827.71C948F186@lantean.jmbsvicetto.name
1 checking arpa/inet.h presence... yes
2 checking for arpa/inet.h... yes
3 checking fcntl.h usability... yes
4 checking fcntl.h presence... yes
5 checking for fcntl.h... yes
6 checking netdb.h usability... yes
7 checking netdb.h presence... yes
8 checking for netdb.h... yes
9 checking netinet/in.h usability... yes
10 checking netinet/in.h presence... yes
11 checking for netinet/in.h... yes
12 checking for stdlib.h... (cached) yes
13 checking for string.h... (cached) yes
14 checking sys/ioctl.h usability... yes
15 checking sys/ioctl.h presence... yes
16 checking for sys/ioctl.h... yes
17 checking sys/socket.h usability... yes
18 checking sys/socket.h presence... yes
19 checking for sys/socket.h... yes
20 checking sys/time.h usability... yes
21 checking sys/time.h presence... yes
22 checking for sys/time.h... yes
23 checking syslog.h usability... yes
24 checking syslog.h presence... yes
25 checking for syslog.h... yes
26 checking for unistd.h... (cached) yes
27 checking linux/compiler.h usability... no
28 checking linux/compiler.h presence... no
29 checking for linux/compiler.h... no
30 checking for an ANSI C-conforming const... yes
31 checking for pid_t... yes
32 checking vfork.h usability... no
33 checking vfork.h presence... no
34 checking for vfork.h... no
35 checking for fork... yes
36 checking for vfork... yes
37 checking for working fork... yes
38 checking for working vfork... (cached) yes
39 checking whether x86_64-pc-linux-gnu-gcc needs -traditional... no
40 checking for stdlib.h... (cached) yes
41 checking for GNU libc compatible malloc... yes
42 checking for dup2... yes
43 checking for gethostbyname... yes
44 checking for gethostname... yes
45 checking for memset... yes
46 checking for strerror... yes
47 configure: creating ./config.status
48 config.status: creating Makefile
49 config.status: creating config.h
50 config.status: executing depfiles commands
51 make all-am
52 make[1]: Entering directory `/var/tmp/portage/sys-apps/arrayprobe-2.0-r2/work/arrayprobe-2.0'
53 x86_64-pc-linux-gnu-gcc -DHAVE_CONFIG_H -I.@am__isrc@ -O2 -pipe -c probe.c
54 x86_64-pc-linux-gnu-gcc -O2 -pipe -Wl,-O1 -Wl,--as-needed -o arrayprobe probe.o
55 make[1]: Leaving directory `/var/tmp/portage/sys-apps/arrayprobe-2.0-r2/work/arrayprobe-2.0'
56 make[1]: Entering directory `/var/tmp/portage/sys-apps/arrayprobe-2.0-r2/work/arrayprobe-2.0'
57 make[1]: Nothing to be done for `install-data-am'.
58 @MKDIR_P@ '/var/tmp/portage/sys-apps/arrayprobe-2.0-r2/image//usr/bin'
59 /bin/sh: line 3: @MKDIR_P@: command not found
60 make[1]: *** [install-binPROGRAMS] Error 1
61 make[1]: Leaving directory `/var/tmp/portage/sys-apps/arrayprobe-2.0-r2/work/arrayprobe-2.0'
62 make: *** [install-am] Error 2
63 * ERROR: sys-apps/arrayprobe-2.0-r2::gentoo failed (install phase):
64 * emake failed
65 *
66 * If you need support, post the output of `emerge --info '=sys-apps/arrayprobe-2.0-r2::gentoo'`,
67 * the complete build log and the output of `emerge -pqv '=sys-apps/arrayprobe-2.0-r2::gentoo'`.
68 * The complete build log is located at '/var/log/portage/sys-apps:arrayprobe-2.0-r2:20140804-125819.log'.
69 * For convenience, a symlink to the build log is located at '/var/tmp/portage/sys-apps/arrayprobe-2.0-r2/temp/build.log'.
70 * The ebuild environment file is located at '/var/tmp/portage/sys-apps/arrayprobe-2.0-r2/temp/environment'.
71 * Working directory: '/var/tmp/portage/sys-apps/arrayprobe-2.0-r2/work/arrayprobe-2.0'
72 * S: '/var/tmp/portage/sys-apps/arrayprobe-2.0-r2/work/arrayprobe-2.0'
73 * QA Notice: command not found:
74 *
75 * /bin/sh: line 3: @MKDIR_P@: command not found
76 * Messages for package sys-libs/glibc-2.19-r1:
77 * Defaulting /etc/host.conf:multi to on
78 * Generating all locales; edit /etc/locale.gen to save time/space
79 * Messages for package sys-libs/timezone-data-2014d:
80 * You do not have TIMEZONE set in /etc/timezone.
81 * Skipping auto-update of /etc/localtime.
82 * Messages for package app-crypt/bcwipe-1.9.8:
83 * The BestCrypt drivers are not free - Please purchace a license from
84 * http://www.jetico.com/
85 * full details /usr/share/doc/bcwipe-1.9.8/html/bcwipe-help/wu_licen.htm
86 * Messages for package net-misc/vconfig-1.9:
87 * MTU problems exist for many ethernet drivers.
88 * Reduce the MTU on the interface to 1496 to work around them.
89 * Messages for package sys-apps/keyutils-1.5.9-r1:
90 * Unable to find kernel sources at /usr/src/linux
91 * Unable to calculate Linux Kernel version for build, attempting to use running version
92 * Messages for package sys-apps/chname-1.0-r1:
93 * Note: chname requires a or later kernel with CONFIG_UTS_NS=y.
94 * Messages for package sys-block/tw_cli-10.2:
95 * This binary supports should support ALL cards, including, but not
96 * limited to the following series:
97 *
98 * PATA: 6xxx, 72xx, 74xx, 78xx, 7000, 7500, 7506
99 * SATA: 8006, 8500, 8506, 9500S, 9550SX, 9590SE,
100 * 9550SXU, 9650SE, 9650SE-{24M8,4LPME},
101 * 9690SA, 9750
102 *
103 * Release notes for this version are available at:
104 * http://www.lsi.com/DistributionSystem/AssetDocument/10.2_Release_Notes_Web.pdf
105 * Upstream's 10.2 release is missing the tw_cli manpage.
106 * Messages for package sys-apps/busybox-1.21.0:
107 * Could not locate user configfile, so we will save a default one
108 * You cannot have USE='static pam'. Assuming static is more important.
109 * Your configuration for sys-apps/busybox-1.21.0 has been saved in
110 * /etc/portage/savedconfig/sys-apps/busybox-1.21.0 for your editing pleasure.
111 * You can edit these files by hand and remerge this package with
112 * USE=savedconfig to customise the configuration.
113 * You can rename this file/directory to one of the following for
114 * its configuration to apply to multiple versions:
115 * ${PORTAGE_CONFIGROOT}/etc/portage/savedconfig/
116 * [${CTARGET}|${CHOST}|""]/${CATEGORY}/[${PF}|${P}|${PN}]
117 * Messages for package net-dialup/ppp-2.4.5-r3:
118 * Unable to find kernel sources at /usr/src/linux
119 * Unable to calculate Linux Kernel version for build, attempting to use running version
120 * Pon, poff and plog scripts have been supplied for experienced users.
121 * Users needing particular scripts (ssh,rsh,etc.) should check out the
122 * /usr/share/doc/ppp-2.4.5-r3/scripts directory.
123 * Messages for package dev-lang/perl-5.18.2-r1:
124 * UPDATE THE PERL MODULES:
125 * After updating dev-lang/perl you must reinstall
126 * the installed perl modules.
127 * Use: perl-cleaner --all
128 * Messages for package net-misc/bridge-utils-1.5:
129 * Unable to find kernel sources at /usr/src/linux
130 * Unable to calculate Linux Kernel version for build, attempting to use running version
131 * Messages for package app-misc/screen-4.0.3-r6:
132 * Some dangerous key bindings have been removed or changed to more safe values.
133 * We enable some xterm hacks in our default screenrc, which might break some
134 * applications. Please check /etc/screenrc for information on these changes.
135 * Messages for package net-dialup/rp-pppoe-3.8-r2:
136 * Use pppoe-setup to configure your dialup connection.
137 * Messages for package sys-apps/arrayprobe-2.0-r2:
138 * ERROR: sys-apps/arrayprobe-2.0-r2::gentoo failed (install phase):
139 * emake failed
140 *
141 * If you need support, post the output of `emerge --info '=sys-apps/arrayprobe-2.0-r2::gentoo'`,
142 * the complete build log and the output of `emerge -pqv '=sys-apps/arrayprobe-2.0-r2::gentoo'`.
143 * The complete build log is located at '/var/log/portage/sys-apps:arrayprobe-2.0-r2:20140804-125819.log'.
144 * For convenience, a symlink to the build log is located at '/var/tmp/portage/sys-apps/arrayprobe-2.0-r2/temp/build.log'.
145 * The ebuild environment file is located at '/var/tmp/portage/sys-apps/arrayprobe-2.0-r2/temp/environment'.
146 * Working directory: '/var/tmp/portage/sys-apps/arrayprobe-2.0-r2/work/arrayprobe-2.0'
147 * S: '/var/tmp/portage/sys-apps/arrayprobe-2.0-r2/work/arrayprobe-2.0'
148
149
150
151
152
153
154
155
156
157
158
159
160
161
162
163
164
165
166
167
168
169
170
171
172
173
174
175
176
177 !!! catalyst: Error in attempt to build packages
178
179
180 Traceback (most recent call last):
181 File "modules/generic_stage_target.py", line 1403, in build_packages
182 "Error in attempt to build packages",env=self.env)
183 File "/usr/lib64/catalyst//modules/catalyst_support.py", line 541, in cmd
184 raise CatalystError,myexc
185 CatalystError
186 None
187
188 !!! catalyst: livecdbuild aborting due to error.
189
190 Traceback (most recent call last):
191 File "/usr/lib64/catalyst/catalyst", line 218, in build_target
192 mytarget.run()
193 File "modules/generic_stage_target.py", line 1304, in run
194 apply(getattr(self,x))
195 File "modules/generic_stage_target.py", line 1408, in build_packages
196 "build aborting due to error."
197 CatalystError
198 !!! catalyst: Error encountered during run of target livecd-stage1
199 Catalyst aborting....
200 lockfile does not exist '/home/release/buildroot/amd64-dev/tmp/hardened/livecd-stage1-amd64-20140804/.catalyst_lock'
201
202
203
204 Full build log at /home/release/tmp/run/catalyst-auto.6239/log/hardened_admincd-stage1.log