Gentoo Archives: gentoo-releng-autobuilds

From: armin76@g.o
To: releng@g.o, gentoo-releng-autobuilds@l.g.o
Subject: [gentoo-releng-autobuilds] [alpha-auto] Catalyst non-fatal build error - installcd-stage2-minimal.spec
Date: Thu, 29 Oct 2015 04:54:04
Message-Id: E1ZrfDo-0005SM-Ii@monolith.freenet-rz.de
*shell/ash.c:9305:15: warning: variable 'oldpath' set but not used [-Wunused-but-set-variable]
*--
*  gcc -Wp,-MD,libbb/.systemd_support.o.d   -std=gnu99 -Iinclude -Ilibbb  -include include/autoconf.h -D_GNU_SOURCE -DNDEBUG -D_LARGEFILE_SOURCE -D_LARGEFILE64_SOURCE -D_FILE_OFFSET_BITS=64 -D"BB_VER=KBUILD_STR(1.20.2)" -DBB_BT=AUTOCONF_TIMESTAMP  -Wall -Wshadow -Wwrite-strings -Wundef -Wstrict-prototypes -Wunused -Wunused-parameter -Wunused-function -Wunused-value -Wmissing-prototypes -Wmissing-declarations -Wdeclaration-after-statement -Wold-style-definition -fno-builtin-strlen -finline-limit=0 -fomit-frame-pointer -ffunction-sections -fdata-sections -fno-guess-branch-probability -funsigned-char -static-libgcc -falign-functions=1 -falign-jumps=1 -falign-labels=1 -falign-loops=1 -Os     -D"KBUILD_STR(s)=#s" -D"KBUILD_BASENAME=KBUILD_STR(systemd_support)"  -D"KBUILD_MODNAME=KBUILD_STR(systemd_support)" -c -o libbb/systemd_support.o libbb/systemd_support.c
*  gcc -Wp,-MD,util-linux/.lsusb.o.d   -std=gnu99 -Iinclude -Ilibbb  -include include/autoconf.h -D_GNU_SOURCE -DNDEBUG -D_LARGEFILE_SOURCE -D_LARGEFILE64_SOURCE -D_FILE_OFFSET_BITS=64 -D"BB_VER=KBUILD_STR(1.20.2)" -DBB_BT=AUTOCONF_TIMESTAMP  -Wall -Wshadow -Wwrite-strings -Wundef -Wstrict-prototypes -Wunused -Wunused-parameter -Wunused-function -Wunused-value -Wmissing-prototypes -Wmissing-declarations -Wdeclaration-after-statement -Wold-style-definition -fno-builtin-strlen -finline-limit=0 -fomit-frame-pointer -ffunction-sections -fdata-sections -fno-guess-branch-probability -funsigned-char -static-libgcc -falign-functions=1 -falign-jumps=1 -falign-labels=1 -falign-loops=1 -Os     -D"KBUILD_STR(s)=#s" -D"KBUILD_BASENAME=KBUILD_STR(lsusb)"  -D"KBUILD_MODNAME=KBUILD_STR(lsusb)" -c -o util-linux/lsusb.o util-linux/lsusb.c
*  gcc -Wp,-MD,libbb/.time.o.d   -std=gnu99 -Iinclude -Ilibbb  -include include/autoconf.h -D_GNU_SOURCE -DNDEBUG -D_LARGEFILE_SOURCE -D_LARGEFILE64_SOURCE -D_FILE_OFFSET_BITS=64 -D"BB_VER=KBUILD_STR(1.20.2)" -DBB_BT=AUTOCONF_TIMESTAMP  -Wall -Wshadow -Wwrite-strings -Wundef -Wstrict-prototypes -Wunused -Wunused-parameter -Wunused-function -Wunused-value -Wmissing-prototypes -Wmissing-declarations -Wdeclaration-after-statement -Wold-style-definition -fno-builtin-strlen -finline-limit=0 -fomit-frame-pointer -ffunction-sections -fdata-sections -fno-guess-branch-probability -funsigned-char -static-libgcc -falign-functions=1 -falign-jumps=1 -falign-labels=1 -falign-loops=1 -Os     -D"KBUILD_STR(s)=#s" -D"KBUILD_BASENAME=KBUILD_STR(time)"  -D"KBUILD_MODNAME=KBUILD_STR(time)" -c -o libbb/time.o libbb/time.c
*  gcc -Wp,-MD,util-linux/volume_id/.hfs.o.d   -std=gnu99 -Iinclude -Ilibbb  -include include/autoconf.h -D_GNU_SOURCE -DNDEBUG -D_LARGEFILE_SOURCE -D_LARGEFILE64_SOURCE -D_FILE_OFFSET_BITS=64 -D"BB_VER=KBUILD_STR(1.20.2)" -DBB_BT=AUTOCONF_TIMESTAMP  -Wall -Wshadow -Wwrite-strings -Wundef -Wstrict-prototypes -Wunused -Wunused-parameter -Wunused-function -Wunused-value -Wmissing-prototypes -Wmissing-declarations -Wdeclaration-after-statement -Wold-style-definition -fno-builtin-strlen -finline-limit=0 -fomit-frame-pointer -ffunction-sections -fdata-sections -fno-guess-branch-probability -funsigned-char -static-libgcc -falign-functions=1 -falign-jumps=1 -falign-labels=1 -falign-loops=1 -Os     -D"KBUILD_STR(s)=#s" -D"KBUILD_BASENAME=KBUILD_STR(hfs)"  -D"KBUILD_MODNAME=KBUILD_STR(hfs)" -c -o util-linux/volume_id/hfs.o util-linux/volume_id/hfs.c
*  gcc -Wp,-MD,util-linux/.mdStart.o.d   -std=gnu99 -Iinclude -Ilibbb  -include include/autoconf.h -D_GNU_SOURCE -DNDEBUG -D_LARGEFILE_SOURCE -D_LARGEFILE64_SOURCE -D_FILE_OFFSET_BITS=64 -D"BB_VER=KBUILD_STR(1.20.2)" -DBB_BT=AUTOCONF_TIMESTAMP  -Wall -Wshadow -Wwrite-strings -Wundef -Wstrict-prototypes -Wunused -Wunused-parameter -Wunused-function -Wunused-value -Wmissing-prototypes -Wmissing-declarations -Wdeclaration-after-statement -Wold-style-definition -fno-builtin-strlen -finline-limit=0 -fomit-frame-pointer -ffunction-sections -fdata-sections -fno-guess-branch-probability -funsigned-char -static-libgcc -falign-functions=1 -falign-jumps=1 -falign-labels=1 -falign-loops=1 -Os     -D"KBUILD_STR(s)=#s" -D"KBUILD_BASENAME=KBUILD_STR(mdStart)"  -D"KBUILD_MODNAME=KBUILD_STR(mdStart)" -c -o util-linux/mdStart.o util-linux/mdStart.c
*util-linux/mdStart.c:37:1: warning: no previous prototype for 'mdstart_main' [-Wmissing-prototypes]
* mdstart_main(int argc, char *argv[])
* ^
*util-linux/mdStart.c: In function 'mdstart_main':
*util-linux/mdStart.c:43:3: warning: implicit declaration of function 'bb_show_usage' [-Wimplicit-function-declaration]
*   bb_show_usage();
*   ^
*util-linux/mdStart.c:48:3: warning: implicit declaration of function 'sscanf' [-Wimplicit-function-declaration]
*   if(sscanf(argv[i], "%d", &part) == 1)
*   ^
*util-linux/mdStart.c:48:6: warning: incompatible implicit declaration of built-in function 'sscanf' [enabled by default]
*   if(sscanf(argv[i], "%d", &part) == 1)
*      ^
*util-linux/mdStart.c:55:4: warning: implicit declaration of function 'close' [-Wimplicit-function-declaration]
*    close(fd);
*    ^
*util-linux/mdStart.c:58:4: warning: implicit declaration of function 'printf' [-Wimplicit-function-declaration]
*    printf("Error: Failed to open %s!
", argv[i]);
*    ^
*util-linux/mdStart.c:58:4: warning: incompatible implicit declaration of built-in function 'printf' [enabled by default]
*  gcc -Wp,-MD,util-linux/.mdev.o.d   -std=gnu99 -Iinclude -Ilibbb  -include include/autoconf.h -D_GNU_SOURCE -DNDEBUG -D_LARGEFILE_SOURCE -D_LARGEFILE64_SOURCE -D_FILE_OFFSET_BITS=64 -D"BB_VER=KBUILD_STR(1.20.2)" -DBB_BT=AUTOCONF_TIMESTAMP  -Wall -Wshadow -Wwrite-strings -Wundef -Wstrict-prototypes -Wunused -Wunused-parameter -Wunused-function -Wunused-value -Wmissing-prototypes -Wmissing-declarations -Wdeclaration-after-statement -Wold-style-definition -fno-builtin-strlen -finline-limit=0 -fomit-frame-pointer -ffunction-sections -fdata-sections -fno-guess-branch-probability -funsigned-char -static-libgcc -falign-functions=1 -falign-jumps=1 -falign-labels=1 -falign-loops=1 -Os     -D"KBUILD_STR(s)=#s" -D"KBUILD_BASENAME=KBUILD_STR(mdev)"  -D"KBUILD_MODNAME=KBUILD_STR(mdev)" -c -o util-linux/mdev.o util-linux/mdev.c
*  gcc -Wp,-MD,libbb/.trim.o.d   -std=gnu99 -Iinclude -Ilibbb  -include include/autoconf.h -D_GNU_SOURCE -DNDEBUG -D_LARGEFILE_SOURCE -D_LARGEFILE64_SOURCE -D_FILE_OFFSET_BITS=64 -D"BB_VER=KBUILD_STR(1.20.2)" -DBB_BT=AUTOCONF_TIMESTAMP  -Wall -Wshadow -Wwrite-strings -Wundef -Wstrict-prototypes -Wunused -Wunused-parameter -Wunused-function -Wunused-value -Wmissing-prototypes -Wmissing-declarations -Wdeclaration-after-statement -Wold-style-definition -fno-builtin-strlen -finline-limit=0 -fomit-frame-pointer -ffunction-sections -fdata-sections -fno-guess-branch-probability -funsigned-char -static-libgcc -falign-functions=1 -falign-jumps=1 -falign-labels=1 -falign-loops=1 -Os     -D"KBUILD_STR(s)=#s" -D"KBUILD_BASENAME=KBUILD_STR(trim)"  -D"KBUILD_MODNAME=KBUILD_STR(trim)" -c -o libbb/trim.o libbb/trim.c
*  gcc -Wp,-MD,util-linux/volume_id/.iso9660.o.d   -std=gnu99 -Iinclude -Ilibbb  -include include/autoconf.h -D_GNU_SOURCE -DNDEBUG -D_LARGEFILE_SOURCE -D_LARGEFILE64_SOURCE -D_FILE_OFFSET_BITS=64 -D"BB_VER=KBUILD_STR(1.20.2)" -DBB_BT=AUTOCONF_TIMESTAMP  -Wall -Wshadow -Wwrite-strings -Wundef -Wstrict-prototypes -Wunused -Wunused-parameter -Wunused-function -Wunused-value -Wmissing-prototypes -Wmissing-declarations -Wdeclaration-after-statement -Wold-style-definition -fno-builtin-strlen -finline-limit=0 -fomit-frame-pointer -ffunction-sections -fdata-sections -fno-guess-branch-probability -funsigned-char -static-libgcc -falign-functions=1 -falign-jumps=1 -falign-labels=1 -falign-loops=1 -Os     -D"KBUILD_STR(s)=#s" -D"KBUILD_BASENAME=KBUILD_STR(iso9660)"  -D"KBUILD_MODNAME=KBUILD_STR(iso9660)" -c -o util-linux/volume_id/iso9660.o util-linux/volume_id/iso9660.c
*util-linux/mdev.c: In function 'make_device':
*util-linux/mdev.c:564:12: warning: ignoring return value of 'symlink', declared with attribute warn_unused_result [-Wunused-result]
*     symlink(node_name, "root");
*            ^
*util-linux/mdev.c:567:10: warning: ignoring return value of 'chown', declared with attribute warn_unused_result [-Wunused-result]
*     chown(node_name, rule->ugid.uid, rule->ugid.gid);
*          ^
*util-linux/mdev.c:574:13: warning: ignoring return value of 'symlink', declared with attribute warn_unused_result [-Wunused-result]
*--
*  gcc -Wp,-MD,shell/.ash_ptr_hack.o.d   -std=gnu99 -Iinclude -Ilibbb  -include include/autoconf.h -D_GNU_SOURCE -DNDEBUG -D_LARGEFILE_SOURCE -D_LARGEFILE64_SOURCE -D_FILE_OFFSET_BITS=64 -D"BB_VER=KBUILD_STR(1.20.2)" -DBB_BT=AUTOCONF_TIMESTAMP  -Wall -Wshadow -Wwrite-strings -Wundef -Wstrict-prototypes -Wunused -Wunused-parameter -Wunused-function -Wunused-value -Wmissing-prototypes -Wmissing-declarations -Wdeclaration-after-statement -Wold-style-definition -fno-builtin-strlen -finline-limit=0 -fomit-frame-pointer -ffunction-sections -fdata-sections -fno-guess-branch-probability -funsigned-char -static-libgcc -falign-functions=1 -falign-jumps=1 -falign-labels=1 -falign-loops=1 -Os     -D"KBUILD_STR(s)=#s" -D"KBUILD_BASENAME=KBUILD_STR(ash_ptr_hack)"  -D"KBUILD_MODNAME=KBUILD_STR(ash_ptr_hack)" -c -o shell/ash_ptr_hack.o shell/ash_ptr_hack.c
*  gcc -Wp,-MD,shell/.math.o.d   -std=gnu99 -Iinclude -Ilibbb  -include include/autoconf.h -D_GNU_SOURCE -DNDEBUG -D_LARGEFILE_SOURCE -D_LARGEFILE64_SOURCE -D_FILE_OFFSET_BITS=64 -D"BB_VER=KBUILD_STR(1.20.2)" -DBB_BT=AUTOCONF_TIMESTAMP  -Wall -Wshadow -Wwrite-strings -Wundef -Wstrict-prototypes -Wunused -Wunused-parameter -Wunused-function -Wunused-value -Wmissing-prototypes -Wmissing-declarations -Wdeclaration-after-statement -Wold-style-definition -fno-builtin-strlen -finline-limit=0 -fomit-frame-pointer -ffunction-sections -fdata-sections -fno-guess-branch-probability -funsigned-char -static-libgcc -falign-functions=1 -falign-jumps=1 -falign-labels=1 -falign-loops=1 -Os     -D"KBUILD_STR(s)=#s" -D"KBUILD_BASENAME=KBUILD_STR(math)"  -D"KBUILD_MODNAME=KBUILD_STR(math)" -c -o shell/math.o shell/math.c
*  gcc -Wp,-MD,libbb/.update_passwd.o.d   -std=gnu99 -Iinclude -Ilibbb  -include include/autoconf.h -D_GNU_SOURCE -DNDEBUG -D_LARGEFILE_SOURCE -D_LARGEFILE64_SOURCE -D_FILE_OFFSET_BITS=64 -D"BB_VER=KBUILD_STR(1.20.2)" -DBB_BT=AUTOCONF_TIMESTAMP  -Wall -Wshadow -Wwrite-strings -Wundef -Wstrict-prototypes -Wunused -Wunused-parameter -Wunused-function -Wunused-value -Wmissing-prototypes -Wmissing-declarations -Wdeclaration-after-statement -Wold-style-definition -fno-builtin-strlen -finline-limit=0 -fomit-frame-pointer -ffunction-sections -fdata-sections -fno-guess-branch-probability -funsigned-char -static-libgcc -falign-functions=1 -falign-jumps=1 -falign-labels=1 -falign-loops=1 -Os     -D"KBUILD_STR(s)=#s" -D"KBUILD_BASENAME=KBUILD_STR(update_passwd)"  -D"KBUILD_MODNAME=KBUILD_STR(update_passwd)" -c -o libbb/update_passwd.o libbb/update_passwd.c
*  gcc -Wp,-MD,util-linux/volume_id/.ntfs.o.d   -std=gnu99 -Iinclude -Ilibbb  -include include/autoconf.h -D_GNU_SOURCE -DNDEBUG -D_LARGEFILE_SOURCE -D_LARGEFILE64_SOURCE -D_FILE_OFFSET_BITS=64 -D"BB_VER=KBUILD_STR(1.20.2)" -DBB_BT=AUTOCONF_TIMESTAMP  -Wall -Wshadow -Wwrite-strings -Wundef -Wstrict-prototypes -Wunused -Wunused-parameter -Wunused-function -Wunused-value -Wmissing-prototypes -Wmissing-declarations -Wdeclaration-after-statement -Wold-style-definition -fno-builtin-strlen -finline-limit=0 -fomit-frame-pointer -ffunction-sections -fdata-sections -fno-guess-branch-probability -funsigned-char -static-libgcc -falign-functions=1 -falign-jumps=1 -falign-labels=1 -falign-loops=1 -Os     -D"KBUILD_STR(s)=#s" -D"KBUILD_BASENAME=KBUILD_STR(ntfs)"  -D"KBUILD_MODNAME=KBUILD_STR(ntfs)" -c -o util-linux/volume_id/ntfs.o util-linux/volume_id/ntfs.c
*libbb/update_passwd.c: In function 'update_passwd':
*libbb/update_passwd.c:138:9: warning: ignoring return value of 'fchown', declared with attribute warn_unused_result [-Wunused-result]
*--
*  gcc -Wp,-MD,libbb/.xfuncs.o.d   -std=gnu99 -Iinclude -Ilibbb  -include include/autoconf.h -D_GNU_SOURCE -DNDEBUG -D_LARGEFILE_SOURCE -D_LARGEFILE64_SOURCE -D_FILE_OFFSET_BITS=64 -D"BB_VER=KBUILD_STR(1.20.2)" -DBB_BT=AUTOCONF_TIMESTAMP  -Wall -Wshadow -Wwrite-strings -Wundef -Wstrict-prototypes -Wunused -Wunused-parameter -Wunused-function -Wunused-value -Wmissing-prototypes -Wmissing-declarations -Wdeclaration-after-statement -Wold-style-definition -fno-builtin-strlen -finline-limit=0 -fomit-frame-pointer -ffunction-sections -fdata-sections -fno-guess-branch-probability -funsigned-char -static-libgcc -falign-functions=1 -falign-jumps=1 -falign-labels=1 -falign-loops=1 -Os     -D"KBUILD_STR(s)=#s" -D"KBUILD_BASENAME=KBUILD_STR(xfuncs)"  -D"KBUILD_MODNAME=KBUILD_STR(xfuncs)" -c -o libbb/xfuncs.o libbb/xfuncs.c
*  gcc -Wp,-MD,libbb/.xfuncs_printf.o.d   -std=gnu99 -Iinclude -Ilibbb  -include include/autoconf.h -D_GNU_SOURCE -DNDEBUG -D_LARGEFILE_SOURCE -D_LARGEFILE64_SOURCE -D_FILE_OFFSET_BITS=64 -D"BB_VER=KBUILD_STR(1.20.2)" -DBB_BT=AUTOCONF_TIMESTAMP  -Wall -Wshadow -Wwrite-strings -Wundef -Wstrict-prototypes -Wunused -Wunused-parameter -Wunused-function -Wunused-value -Wmissing-prototypes -Wmissing-declarations -Wdeclaration-after-statement -Wold-style-definition -fno-builtin-strlen -finline-limit=0 -fomit-frame-pointer -ffunction-sections -fdata-sections -fno-guess-branch-probability -funsigned-char -static-libgcc -falign-functions=1 -falign-jumps=1 -falign-labels=1 -falign-loops=1 -Os     -D"KBUILD_STR(s)=#s" -D"KBUILD_BASENAME=KBUILD_STR(xfuncs_printf)"  -D"KBUILD_MODNAME=KBUILD_STR(xfuncs_printf)" -c -o libbb/xfuncs_printf.o libbb/xfuncs_printf.c
*  gcc -Wp,-MD,util-linux/.umount.o.d   -std=gnu99 -Iinclude -Ilibbb  -include include/autoconf.h -D_GNU_SOURCE -DNDEBUG -D_LARGEFILE_SOURCE -D_LARGEFILE64_SOURCE -D_FILE_OFFSET_BITS=64 -D"BB_VER=KBUILD_STR(1.20.2)" -DBB_BT=AUTOCONF_TIMESTAMP  -Wall -Wshadow -Wwrite-strings -Wundef -Wstrict-prototypes -Wunused -Wunused-parameter -Wunused-function -Wunused-value -Wmissing-prototypes -Wmissing-declarations -Wdeclaration-after-statement -Wold-style-definition -fno-builtin-strlen -finline-limit=0 -fomit-frame-pointer -ffunction-sections -fdata-sections -fno-guess-branch-probability -funsigned-char -static-libgcc -falign-functions=1 -falign-jumps=1 -falign-labels=1 -falign-loops=1 -Os     -D"KBUILD_STR(s)=#s" -D"KBUILD_BASENAME=KBUILD_STR(umount)"  -D"KBUILD_MODNAME=KBUILD_STR(umount)" -c -o util-linux/umount.o util-linux/umount.c
*  gcc -Wp,-MD,libbb/.xgetcwd.o.d   -std=gnu99 -Iinclude -Ilibbb  -include include/autoconf.h -D_GNU_SOURCE -DNDEBUG -D_LARGEFILE_SOURCE -D_LARGEFILE64_SOURCE -D_FILE_OFFSET_BITS=64 -D"BB_VER=KBUILD_STR(1.20.2)" -DBB_BT=AUTOCONF_TIMESTAMP  -Wall -Wshadow -Wwrite-strings -Wundef -Wstrict-prototypes -Wunused -Wunused-parameter -Wunused-function -Wunused-value -Wmissing-prototypes -Wmissing-declarations -Wdeclaration-after-statement -Wold-style-definition -fno-builtin-strlen -finline-limit=0 -fomit-frame-pointer -ffunction-sections -fdata-sections -fno-guess-branch-probability -funsigned-char -static-libgcc -falign-functions=1 -falign-jumps=1 -falign-labels=1 -falign-loops=1 -Os     -D"KBUILD_STR(s)=#s" -D"KBUILD_BASENAME=KBUILD_STR(xgetcwd)"  -D"KBUILD_MODNAME=KBUILD_STR(xgetcwd)" -c -o libbb/xgetcwd.o libbb/xgetcwd.c
*libbb/xfuncs_printf.c: In function 'generate_uuid':
*libbb/xfuncs_printf.c:593:7: warning: ignoring return value of 'read', declared with attribute warn_unused_result [-Wunused-result]
*--
*DEPS=`echo ../make.tmpl ../VERSION ../Makefile ../include/.symlinks_created | sed -e 's/\//\\\//g'`; \
*gcc -MM -I. -I../include -DHAVE_CONFIG_H -DDM_IOCTLS -fPIC -fPIC -Wall -Wundef -Wshadow -Wcast-align -Wwrite-strings -Wmissing-prototypes -Wmissing-declarations -Wnested-externs -Winline -Wmissing-noreturn -Wformat-security -Wredundant-decls -Wpointer-arith -O2 -o device/device.d device/device.c; \
*sed -i "s/\(.*\)\.o[ :]*/$FILE.o $FILE.d $FILE.pot: $DEPS /g" device/device.d; \
*[ -s device/device.d ] || rm -f device/device.d
*ioctl/libdm-iface.c: In function '_unmarshal_status':
*ioctl/libdm-iface.c:595:10: warning: cast increases required alignment of target type [-Wcast-align]
*   spec = (struct dm_target_spec *) outptr;
*          ^
*ioctl/libdm-iface.c: In function 'dm_task_get_deps':
*ioctl/libdm-iface.c:682:9: warning: cast increases required alignment of target type [-Wcast-align]
*  return (struct dm_deps *) (((char *) dmt->dmi.v4) +
*         ^
*ioctl/libdm-iface.c: In function 'dm_task_get_names':
*ioctl/libdm-iface.c:688:9: warning: cast increases required alignment of target type [-Wcast-align]
*  return (struct dm_names *) (((char *) dmt->dmi.v4) +
*         ^
*ioctl/libdm-iface.c: In function 'dm_task_get_versions':
*ioctl/libdm-iface.c:694:9: warning: cast increases required alignment of target type [-Wcast-align]
*--
*DEPS=`echo ../make.tmpl ../VERSION ../Makefile ../include/.symlinks_created | sed -e 's/\//\\\//g'`; \
*gcc -MM -I. -I../include -DHAVE_CONFIG_H -DDM_IOCTLS -fPIC -fPIC -Wall -Wundef -Wshadow -Wcast-align -Wwrite-strings -Wmissing-prototypes -Wmissing-declarations -Wnested-externs -Winline -Wmissing-noreturn -Wformat-security -Wredundant-decls -Wpointer-arith -O2 -o device/dev-luks.d device/dev-luks.c; \
*sed -i "s/\(.*\)\.o[ :]*/$FILE.o $FILE.d $FILE.pot: $DEPS /g" device/dev-luks.d; \
*[ -s device/dev-luks.d ] || rm -f device/dev-luks.d
*ioctl/libdm-iface.c: In function '_lookup_dev_name':
*ioctl/libdm-iface.c:932:11: warning: cast increases required alignment of target type [-Wcast-align]
*--
*DEPS=`echo ../make.tmpl ../VERSION ../Makefile ../include/.symlinks_created | sed -e 's/\//\\\//g'`; \
*gcc -MM -I. -I../include -DHAVE_CONFIG_H -DDM_IOCTLS -fPIC -fPIC -Wall -Wundef -Wshadow -Wcast-align -Wwrite-strings -Wmissing-prototypes -Wmissing-declarations -Wnested-externs -Winline -Wmissing-noreturn -Wformat-security -Wredundant-decls -Wpointer-arith -O2 -o device/dev-swap.d device/dev-swap.c; \
*sed -i "s/\(.*\)\.o[ :]*/$FILE.o $FILE.d $FILE.pot: $DEPS /g" device/dev-swap.d; \
*[ -s device/dev-swap.d ] || rm -f device/dev-swap.d
*ioctl/libdm-iface.c: In function '_flatten':
*ioctl/libdm-iface.c:1116:10: warning: cast increases required alignment of target type [-Wcast-align]
*   tmsg = (struct dm_target_msg *) b;
*          ^
*ioctl/libdm-iface.c: In function '_process_all_v4':
*ioctl/libdm-iface.c:1190:11: warning: cast increases required alignment of target type [-Wcast-align]
*--
*gcc -MM -I. -I../include -DLVM_SHARED_PATH=\"//sbin/lvm\" -DHAVE_CONFIG_H -DDM_IOCTLS -fPIC -fPIC -Wall -Wundef -Wshadow -Wcast-align -Wwrite-strings -Wmissing-prototypes -Wmissing-declarations -Wnested-externs -Winline -Wmissing-noreturn -Wformat-security -Wredundant-decls -Wpointer-arith -O2 -o dumpconfig.d dumpconfig.c; \
*sed -i "s/\(.*\)\.o[ :]*/$FILE.o $FILE.d $FILE.pot: $DEPS /g" dumpconfig.d; \
*[ -s dumpconfig.d ] || rm -f dumpconfig.d
*gcc -c -I. -I../include -DLVM_SHARED_PATH=\"//sbin/lvm\" -DHAVE_CONFIG_H -DDM_IOCTLS -fPIC -fPIC -Wall -Wundef -Wshadow -Wcast-align -Wwrite-strings -Wmissing-prototypes -Wmissing-declarations -Wnested-externs -Winline -Wmissing-noreturn -Wformat-security -Wredundant-decls -Wpointer-arith -O2 dmsetup.c -o dmsetup.o
*dmsetup.c: In function '_process_all':
*dmsetup.c:1360:11: warning: cast increases required alignment of target type [-Wcast-align]
*   names = (struct dm_names *)((char *) names + next);
*           ^
*dmsetup.c: In function '_targets':
*dmsetup.c:1708:12: warning: cast increases required alignment of target type [-Wcast-align]
*--
*Creating vgsplit.8
*Creating fsadm.8
*make[1]: Leaving directory '/var/tmp/genkernel/31500.532.996.11278/LVM2.2.02.88/man'
*gcc -c -I. -I../include -DHAVE_CONFIG_H -DDM_IOCTLS -fPIC -fPIC -Wall -Wundef -Wshadow -Wcast-align -Wwrite-strings -Wmissing-prototypes -Wmissing-declarations -Wnested-externs -Winline -Wmissing-noreturn -Wformat-security -Wredundant-decls -Wpointer-arith -O2 config/config.c -o config/config.o
*activate/activate.c: In function 'target_version':
*activate/activate.c:419:12: warning: cast increases required alignment of target type [-Wcast-align]
*   target = (struct dm_versions *)((char *) target + target->next);
*            ^
*commands/toolcontext.c: In function '_init_dev_cache':
*commands/toolcontext.c:664:8: warning: 'udev_dir_len' may be used uninitialized in this function [-Wmaybe-uninitialized]
*--
*gcc -c -I. -I../include -DHAVE_CONFIG_H -DDM_IOCTLS -fPIC -fPIC -Wall -Wundef -Wshadow -Wcast-align -Wwrite-strings -Wmissing-prototypes -Wmissing-declarations -Wnested-externs -Winline -Wmissing-noreturn -Wformat-security -Wredundant-decls -Wpointer-arith -O2 metadata/segtype.c -o metadata/segtype.o
*gcc -c -I. -I../include -DHAVE_CONFIG_H -DDM_IOCTLS -fPIC -fPIC -Wall -Wundef -Wshadow -Wcast-align -Wwrite-strings -Wmissing-prototypes -Wmissing-declarations -Wnested-externs -Winline -Wmissing-noreturn -Wformat-security -Wredundant-decls -Wpointer-arith -O2 metadata/snapshot_manip.c -o metadata/snapshot_manip.o
*gcc -c -I. -I../include -DHAVE_CONFIG_H -DDM_IOCTLS -fPIC -fPIC -Wall -Wundef -Wshadow -Wcast-align -Wwrite-strings -Wmissing-prototypes -Wmissing-declarations -Wnested-externs -Winline -Wmissing-noreturn -Wformat-security -Wredundant-decls -Wpointer-arith -O2 metadata/vg.c -o metadata/vg.o
*gcc -c -I. -I../include -DHAVE_CONFIG_H -DDM_IOCTLS -fPIC -fPIC -Wall -Wundef -Wshadow -Wcast-align -Wwrite-strings -Wmissing-prototypes -Wmissing-declarations -Wnested-externs -Winline -Wmissing-noreturn -Wformat-security -Wredundant-decls -Wpointer-arith -O2 misc/crc.c -o misc/crc.o
*misc/crc.c: In function 'calc_crc':
*misc/crc.c:63:26: warning: cast increases required alignment of target type [-Wcast-align]
*  const uint32_t *start = (const uint32_t *) buf;
*                          ^
*misc/crc.c:64:24: warning: cast increases required alignment of target type [-Wcast-align]
*  const uint32_t *end = (const uint32_t *) (buf + (size & 0xfffffffc));
*                        ^
*metadata/metadata.c: In function '_get_pvs':
*metadata/metadata.c:3674:12: warning: 'results' may be used uninitialized in this function [-Wmaybe-uninitialized]
*--
*gcc -c -I. -I../include -DHAVE_CONFIG_H -DDM_IOCTLS -fPIC -fPIC -Wall -Wundef -Wshadow -Wcast-align -Wwrite-strings -Wmissing-prototypes -Wmissing-declarations -Wnested-externs -Winline -Wmissing-noreturn -Wformat-security -Wredundant-decls -Wpointer-arith -O2 misc/util.c -o misc/util.o
*gcc -c -I. -I../include -DHAVE_CONFIG_H -DDM_IOCTLS -fPIC -fPIC -Wall -Wundef -Wshadow -Wcast-align -Wwrite-strings -Wmissing-prototypes -Wmissing-declarations -Wnested-externs -Winline -Wmissing-noreturn -Wformat-security -Wredundant-decls -Wpointer-arith -O2 mm/memlock.c -o mm/memlock.o
*gcc -c -I. -I../include -DHAVE_CONFIG_H -DDM_IOCTLS -fPIC -fPIC -Wall -Wundef -Wshadow -Wcast-align -Wwrite-strings -Wmissing-prototypes -Wmissing-declarations -Wnested-externs -Winline -Wmissing-noreturn -Wformat-security -Wredundant-decls -Wpointer-arith -O2 report/properties.c -o report/properties.o
*gcc -c -I. -I../include -DHAVE_CONFIG_H -DDM_IOCTLS -fPIC -fPIC -Wall -Wundef -Wshadow -Wcast-align -Wwrite-strings -Wmissing-prototypes -Wmissing-declarations -Wnested-externs -Winline -Wmissing-noreturn -Wformat-security -Wredundant-decls -Wpointer-arith -O2 report/report.c -o report/report.o
*mm/memlock.c: In function '_touch_memory':
*mm/memlock.c:119:4: warning: cast increases required alignment of target type [-Wcast-align]
*--
*gcc -c -I. -I../include -DLVM_SHARED_PATH=\"//sbin/lvm\" -DHAVE_CONFIG_H -DDM_IOCTLS -fPIC -fPIC -Wall -Wundef -Wshadow -Wcast-align -Wwrite-strings -Wmissing-prototypes -Wmissing-declarations -Wnested-externs -Winline -Wmissing-noreturn -Wformat-security -Wredundant-decls -Wpointer-arith -O2 lvextend.c -o lvextend.o
*gcc -c -I. -I../include -DLVM_SHARED_PATH=\"//sbin/lvm\" -DHAVE_CONFIG_H -DDM_IOCTLS -fPIC -fPIC -Wall -Wundef -Wshadow -Wcast-align -Wwrite-strings -Wmissing-prototypes -Wmissing-declarations -Wnested-externs -Winline -Wmissing-noreturn -Wformat-security -Wredundant-decls -Wpointer-arith -O2 lvmchange.c -o lvmchange.o
*gcc -c -I. -I../include -DLVM_SHARED_PATH=\"//sbin/lvm\" -DHAVE_CONFIG_H -DDM_IOCTLS -fPIC -fPIC -Wall -Wundef -Wshadow -Wcast-align -Wwrite-strings -Wmissing-prototypes -Wmissing-declarations -Wnested-externs -Winline -Wmissing-noreturn -Wformat-security -Wredundant-decls -Wpointer-arith -O2 lvmcmdline.c -o lvmcmdline.o
*gcc -c -I. -I../include -DLVM_SHARED_PATH=\"//sbin/lvm\" -DHAVE_CONFIG_H -DDM_IOCTLS -fPIC -fPIC -Wall -Wundef -Wshadow -Wcast-align -Wwrite-strings -Wmissing-prototypes -Wmissing-declarations -Wnested-externs -Winline -Wmissing-noreturn -Wformat-security -Wredundant-decls -Wpointer-arith -O2 lvmdiskscan.c -o lvmdiskscan.o
*lvconvert.c: In function '_lvconvert_single':
*lvconvert.c:1450:36: warning: 'image_count' may be used uninitialized in this function [-Wmaybe-uninitialized]
*--
*	-llvm-internal  -ldl -ldevmapper    -rdynamic
*gcc -fPIC -fPIC -Wall -Wundef -Wshadow -Wcast-align -Wwrite-strings -Wmissing-prototypes -Wmissing-declarations -Wnested-externs -Winline -Wmissing-noreturn -Wformat-security -Wredundant-decls -Wpointer-arith -O2 -Wl,--export-dynamic -L../libdm -L../lib -Wl,--no-export-dynamic -static -L../libdm/ioctl -o lvm.static \
*      dumpconfig.o formats.o lvchange.o lvconvert.o lvcreate.o lvdisplay.o lvextend.o lvmchange.o lvmcmdline.o lvmdiskscan.o lvreduce.o lvremove.o lvrename.o lvresize.o lvscan.o polldaemon.o pvchange.o pvck.o pvcreate.o pvdisplay.o pvmove.o pvremove.o pvresize.o pvscan.o reporter.o segtypes.o toollib.o vgcfgbackup.o vgcfgrestore.o vgchange.o vgck.o vgcreate.o vgconvert.o vgdisplay.o vgexport.o vgextend.o vgimport.o vgmerge.o vgmknodes.o vgreduce.o vgremove.o vgrename.o vgscan.o vgsplit.o lvm-static.o -llvm-internal  -ldl -ldevmapper    
*ar rs liblvm2cmd.a dumpconfig.o formats.o lvchange.o lvconvert.o lvcreate.o lvdisplay.o lvextend.o lvmchange.o lvmcmdline.o lvmdiskscan.o lvreduce.o lvremove.o lvrename.o lvresize.o lvscan.o polldaemon.o pvchange.o pvck.o pvcreate.o pvdisplay.o pvmove.o pvremove.o pvresize.o pvscan.o reporter.o segtypes.o toollib.o vgcfgbackup.o vgcfgrestore.o vgchange.o vgck.o vgcreate.o vgconvert.o vgdisplay.o vgexport.o vgextend.o vgimport.o vgmerge.o vgmknodes.o vgreduce.o vgremove.o vgrename.o vgscan.o vgsplit.o lvmcmdlib.o lvm2cmd.o
*../lib/liblvm-internal.a(sharedlib.o): In function `load_shared_library':
*(.text+0x1b8): warning: Using 'dlopen' in statically linked applications requires at runtime the shared libraries from the glibc version used for linking
*--
*checking getopt.h presence... yes
*checking for getopt.h... yes
*checking for dlopen in -ldl... yes
*checking for pthread_mutex_lock in -lpthread... yes
*checking for dm_event_handler_create in -ldevmapper-event... no
*configure: error: device-mapper-event library is either missing or is too old and badly linked
*--
* Running with options: --lvm --dmraid --mdadm --cachedir=/tmp/kerncache/gentoo-genkernel_cache-20151028 --no-mountboot --kerneldir=/usr/src/linux --modulespackage=/tmp/kerncache/gentoo-modules-20151028.tar.bz2 --minkernpackage=/tmp/kerncache/gentoo-kernel-initrd-20151028.tar.bz2 all --kernel-config=/var/tmp/gentoo.config
* Using genkernel.conf from /etc/genkernel.conf
* Sourcing arch-specific config.sh from /usr/share/genkernel/arch/alpha/config.sh ..
* Sourcing arch-specific modules_load from /usr/share/genkernel/arch/alpha/modules_load ..
*
* ERROR: Configure of dmraid failed!
* 
* -- End log... --
* 
* Please consult /var/log/genkernel.log for more information and any
* errors that were reported above.
* 
* Report any genkernel bugs to bugs.gentoo.org and
* assign your bug to genkernel@g.o. Please include
* as much information as you can in your bug report; attaching
* /var/log/genkernel.log so that your issue can be dealt with effectively.
* 
* Please do *not* report compilation failures as genkernel bugs!
* 

!!! catalyst: Runscript kernel build failed


Traceback (most recent call last):
  File "modules/generic_stage_target.py", line 1428, in build_kernel
    self._build_kernel(kname=kname)
  File "modules/generic_stage_target.py", line 1472, in _build_kernel
    "Runscript kernel build failed",env=self.env)
  File "/usr/lib/catalyst/modules/catalyst_support.py", line 541, in cmd
    raise CatalystError,myexc
CatalystError
None

!!! catalyst: build aborting due to kernel build error.

Traceback (most recent call last):
File "/usr/lib/catalyst/catalyst", line 218, in build_target
    mytarget.run()
File "modules/generic_stage_target.py", line 1304, in run
    apply(getattr(self,x))
File "modules/generic_stage_target.py", line 1433, in build_kernel
    "build aborting due to kernel build error."
CatalystError
!!! catalyst: Error encountered during run of target livecd-stage2
Catalyst aborting....
lockfile does not exist '/space/catalyst/tmp/default/livecd-stage2-alpha-20151028/.catalyst_lock'



Full build log at /tmp/catalyst-auto.4WYBT1/log/installcd-stage2-minimal.log