Gentoo Archives: gentoo-releng-autobuilds

From: catalyst@××××××××××××××.org
To: releng@g.o, gentoo-releng-autobuilds@l.g.o
Subject: [gentoo-releng-autobuilds] [amd64-auto] Catalyst non-fatal build error - hardened/admincd-stage1.spec
Date: Thu, 14 Aug 2014 15:15:09
Message-Id: 20140814151503.895AA1B65A@skimmer.gentoo.org
1 >>> Installing (56 of 274) sys-fs/reiserfsprogs-3.6.24
2 >>> Recording sys-fs/reiserfsprogs in "world" favorites file...
3 >>> Emerging (57 of 274) sys-process/lsof-4.85-r2
4 >>> Installing (57 of 274) sys-process/lsof-4.85-r2
5 >>> Recording sys-process/lsof in "world" favorites file...
6 >>> Emerging (58 of 274) sys-libs/cracklib-2.9.1-r1
7 >>> Installing (58 of 274) sys-libs/cracklib-2.9.1-r1
8 >>> Emerging (59 of 274) sys-apps/file-5.17
9 >>> Installing (59 of 274) sys-apps/file-5.17
10 >>> Emerging (60 of 274) sys-apps/keyutils-1.5.9-r1
11 >>> Installing (60 of 274) sys-apps/keyutils-1.5.9-r1
12 >>> Emerging (61 of 274) media-libs/libpng-1.6.12
13 >>> Installing (61 of 274) media-libs/libpng-1.6.12
14 >>> Emerging (62 of 274) sys-apps/miscfiles-1.5-r1
15 >>> Installing (62 of 274) sys-apps/miscfiles-1.5-r1
16 >>> Emerging (63 of 274) dev-libs/gmp-5.1.3-r1
17 >>> Installing (63 of 274) dev-libs/gmp-5.1.3-r1
18 >>> Emerging (64 of 274) dev-libs/boost-1.52.0-r7
19 >>> Installing (64 of 274) dev-libs/boost-1.52.0-r7
20 >>> Emerging (65 of 274) sys-devel/dev86-0.16.19
21 >>> Installing (65 of 274) sys-devel/dev86-0.16.19
22 >>> Emerging (66 of 274) app-arch/pbzip2-1.1.8
23 >>> Installing (66 of 274) app-arch/pbzip2-1.1.8
24 >>> Recording app-arch/pbzip2 in "world" favorites file...
25 >>> Emerging (67 of 274) app-editors/hexcurse-1.55
26 >>> Installing (67 of 274) app-editors/hexcurse-1.55
27 >>> Recording app-editors/hexcurse in "world" favorites file...
28 >>> Emerging (68 of 274) app-editors/hexedit-1.2.13
29 >>> Installing (68 of 274) app-editors/hexedit-1.2.13
30 >>> Recording app-editors/hexedit in "world" favorites file...
31 >>> Emerging (69 of 274) sys-apps/chname-1.0-r1
32 >>> Installing (69 of 274) sys-apps/chname-1.0-r1
33 >>> Recording sys-apps/chname in "world" favorites file...
34 >>> Emerging (70 of 274) sys-apps/ethtool-3.12.1
35 >>> Installing (70 of 274) sys-apps/ethtool-3.12.1
36 >>> Recording sys-apps/ethtool in "world" favorites file...
37 >>> Emerging (71 of 274) sys-block/fio-2.0.14-r1
38 >>> Failed to emerge sys-block/fio-2.0.14-r1, Log file:
39 >>> '/var/tmp/portage/sys-block/fio-2.0.14-r1/temp/build.log'
40 * Package: sys-block/fio-2.0.14-r1
41 * Repository: gentoo
42 * Maintainer: robbat2@g.o prometheanfire@g.o
43 * USE: abi_x86_64 amd64 elibc_glibc kernel_linux userland_GNU
44 * FEATURES: preserve-libs sandbox userpriv usersandbox
45 * Applying fio-2.0.14-pic-clobber-fix.patch ...
46 [ ok ]
47 ./configure: line 329: /var/tmp/portage/sys-block/fio-2.0.14-r1/temp/fio-conf-1606-10644-6852.exe: Permission denied
48 Operating system Linux
49 CPU x86_64
50 Big endian no
51 Compiler x86_64-pc-linux-gnu-gcc
52
53 ./configure: line 352: /var/tmp/portage/sys-block/fio-2.0.14-r1/temp/fio-conf-1606-10644-6852.exe: Permission denied
54 Wordsize
55 Linux AIO support yes
56 POSIX AIO support yes
57 POSIX AIO support needs -lrt yes
58 POSIX AIO fsync yes
59 Solaris AIO support no
60 __sync_fetch_and add yes
61 libverbs no
62 rdmacm no
63 Linux fallocate yes
64 POSIX fadvise yes
65 POSIX fallocate yes
66 sched_setaffinity(3 arg) yes
67 sched_setaffinity(2 arg) no
68 clock_gettime yes
69 CLOCK_MONOTONIC yes
70 CLOCK_MONOTONIC_PRECISE no
71 gettimeofday yes
72 fdatasync yes
73 sync_file_range yes
74 EXT4 move extent yes
75 Linux splice(2) yes
76 GUASI no
77 Fusion-io atomic engine no
78 libnuma no
79 strsep yes
80 getopt_long_only() yes
81 inet_aton yes
82 socklen_t yes
83 __thread yes
84 RUSAGE_THREAD yes
85 SCHED_IDLE yes
86 TCP_NODELAY yes
87 Unknown wordsize!
88 Configure failed, check config.log and/or the above output
89 Makefile:21: config-host.mak: No such file or directory
90 FIO_VERSION = fio-2.0.14
91 Running configure for you...
92 ./configure: line 329: /var/tmp/portage/sys-block/fio-2.0.14-r1/temp/fio-conf-8449-10897-23382.exe: Permission denied
93 Operating system Linux
94 CPU x86_64
95 Big endian no
96 Compiler gcc
97
98 ./configure: line 352: /var/tmp/portage/sys-block/fio-2.0.14-r1/temp/fio-conf-8449-10897-23382.exe: Permission denied
99 Wordsize
100 Linux AIO support yes
101 POSIX AIO support yes
102 POSIX AIO support needs -lrt yes
103 POSIX AIO fsync yes
104 Solaris AIO support no
105 __sync_fetch_and add yes
106 libverbs no
107 rdmacm no
108 Linux fallocate yes
109 POSIX fadvise yes
110 POSIX fallocate yes
111 sched_setaffinity(3 arg) yes
112 sched_setaffinity(2 arg) no
113 clock_gettime yes
114 CLOCK_MONOTONIC yes
115 CLOCK_MONOTONIC_PRECISE no
116 gettimeofday yes
117 fdatasync yes
118 sync_file_range yes
119 EXT4 move extent yes
120 Linux splice(2) yes
121 GUASI no
122 Fusion-io atomic engine no
123 libnuma no
124 strsep yes
125 getopt_long_only() yes
126 inet_aton yes
127 socklen_t yes
128 __thread yes
129 RUSAGE_THREAD yes
130 SCHED_IDLE yes
131 TCP_NODELAY yes
132 Unknown wordsize!
133 Configure failed, check config.log and/or the above output
134 make: *** [config-host.mak] Error 1
135 * ERROR: sys-block/fio-2.0.14-r1::gentoo failed (compile phase):
136 * emake failed
137 *
138 * If you need support, post the output of `emerge --info '=sys-block/fio-2.0.14-r1::gentoo'`,
139 * the complete build log and the output of `emerge -pqv '=sys-block/fio-2.0.14-r1::gentoo'`.
140 * The complete build log is located at '/var/tmp/portage/sys-block/fio-2.0.14-r1/temp/build.log'.
141 * The ebuild environment file is located at '/var/tmp/portage/sys-block/fio-2.0.14-r1/temp/environment'.
142 * Working directory: '/var/tmp/portage/sys-block/fio-2.0.14-r1/work/fio-2.0.14'
143 * S: '/var/tmp/portage/sys-block/fio-2.0.14-r1/work/fio-2.0.14'
144 * Messages for package app-crypt/bcwipe-1.9.8:
145 * The BestCrypt drivers are not free - Please purchace a license from
146 * http://www.jetico.com/
147 * full details /usr/share/doc/bcwipe-1.9.8/html/bcwipe-help/wu_licen.htm
148 * Messages for package net-misc/vconfig-1.9:
149 * MTU problems exist for many ethernet drivers.
150 * Reduce the MTU on the interface to 1496 to work around them.
151 * Messages for package sys-apps/keyutils-1.5.9-r1:
152 * Unable to find kernel sources at /usr/src/linux
153 * Unable to calculate Linux Kernel version for build, attempting to use running version
154 * Messages for package sys-apps/chname-1.0-r1:
155 * Note: chname requires a or later kernel with CONFIG_UTS_NS=y.
156 * Messages for package sys-block/fio-2.0.14-r1:
157 * ERROR: sys-block/fio-2.0.14-r1::gentoo failed (compile phase):
158 * emake failed
159 *
160 * If you need support, post the output of `emerge --info '=sys-block/fio-2.0.14-r1::gentoo'`,
161 * the complete build log and the output of `emerge -pqv '=sys-block/fio-2.0.14-r1::gentoo'`.
162 * The complete build log is located at '/var/tmp/portage/sys-block/fio-2.0.14-r1/temp/build.log'.
163 * The ebuild environment file is located at '/var/tmp/portage/sys-block/fio-2.0.14-r1/temp/environment'.
164 * Working directory: '/var/tmp/portage/sys-block/fio-2.0.14-r1/work/fio-2.0.14'
165 * S: '/var/tmp/portage/sys-block/fio-2.0.14-r1/work/fio-2.0.14'
166
167
168
169
170
171
172
173
174
175
176
177 !!! catalyst: Error in attempt to build packages
178
179
180 Traceback (most recent call last):
181 File "modules/generic_stage_target.py", line 1403, in build_packages
182 "Error in attempt to build packages",env=self.env)
183 File "/usr/lib64/catalyst//modules/catalyst_support.py", line 541, in cmd
184 raise CatalystError,myexc
185 CatalystError
186 None
187
188 !!! catalyst: livecdbuild aborting due to error.
189
190 Traceback (most recent call last):
191 File "/usr/lib64/catalyst/catalyst", line 218, in build_target
192 mytarget.run()
193 File "modules/generic_stage_target.py", line 1304, in run
194 apply(getattr(self,x))
195 File "modules/generic_stage_target.py", line 1408, in build_packages
196 "build aborting due to error."
197 CatalystError
198 !!! catalyst: Error encountered during run of target livecd-stage1
199 Catalyst aborting....
200 lockfile does not exist '/release/buildroot/amd64-dev/tmp/hardened/livecd-stage1-amd64-20140814/.catalyst_lock'
201
202
203
204 Full build log at /release/tmp/run/catalyst-auto.16409/log/hardened_admincd-stage1.log