Gentoo Archives: gentoo-releng-autobuilds

From: catalyst@×××××××××××××××××××××××××××××.org
To: releng@g.o, gentoo-releng-autobuilds@l.g.o
Subject: [gentoo-releng-autobuilds] [ppc64-auto] Catalyst fatal build error - stage3-64ul.spec
Date: Sun, 31 Aug 2014 19:53:17
Message-Id: 20140831195314.A0A59E0B5B@pigeon.gentoo.org
1 cp -f /var/tmp/portage/sys-apps/groff-1.22.2/work/groff-1.22.2/font/devps/generate/dingbats.map \
2 /var/tmp/portage/sys-apps/groff-1.22.2/work/groff-1.22.2/font/devpdf/map
3 cp -f /var/tmp/portage/sys-apps/groff-1.22.2/work/groff-1.22.2/font/devps/generate/textmap \
4 /var/tmp/portage/sys-apps/groff-1.22.2/work/groff-1.22.2/font/devpdf/map
5 make[2]: *** [examples/mixed_pickles.ps] Error 2
6 make[2]: *** Waiting for unfinished jobs....
7 cp -f /var/tmp/portage/sys-apps/groff-1.22.2/work/groff-1.22.2/font/devps/generate/symbolchars \
8 /var/tmp/portage/sys-apps/groff-1.22.2/work/groff-1.22.2/font/devpdf/map
9 test -d util || /bin/sh /var/tmp/portage/sys-apps/groff-1.22.2/work/groff-1.22.2/mkinstalldirs util
10 rm -f util/BuildFoundries
11 if test -n "/usr/bin/perl"; then \
12 sed -f /var/tmp/portage/sys-apps/groff-1.22.2/work/groff-1.22.2/arch/misc/shdeps.sed \
13 -e "s|/usr/bin/perl|/usr/bin/perl|" \
14 -e "s|@GROFF_GHOSTSCRIPT_INTERPRETERS@|missing|" \
15 -e "s|@VERSION@|1.22.2|" \
16 -e "s|@GROFF_FONT_DIR@|/usr/share/groff/1.22.2/font|" \
17 ./util/BuildFoundries.pl \
18 >/var/tmp/portage/sys-apps/groff-1.22.2/work/groff-1.22.2/font/devpdf/util/BuildFoundries ;\
19 else \
20 sed -f /var/tmp/portage/sys-apps/groff-1.22.2/work/groff-1.22.2/arch/misc/shdeps.sed \
21 -e "s|@VERSION@|1.22.2|" \
22 -e "s|@GROFF_FONT_DIR@|/usr/share/groff/1.22.2/font|" \
23 ./util/BuildFoundries.pl \
24 >/var/tmp/portage/sys-apps/groff-1.22.2/work/groff-1.22.2/font/devpdf/util/BuildFoundries ;\
25 fi
26 chmod +x util/BuildFoundries
27 echo "# foundry ps name psfile" > /var/tmp/portage/sys-apps/groff-1.22.2/work/groff-1.22.2/font/devpdf/download
28 PATH="/var/tmp/portage/sys-apps/groff-1.22.2/work/groff-1.22.2/src/utils/afmtodit:/var/tmp/portage/._portage_reinstall_.LvduKT/bin/ebuild-helpers:/usr/local/sbin:/usr/local/bin:/usr/sbin:/usr/bin:/sbin:/bin:/opt/bin:/usr/powerpc64-unknown-linux-gnu/gcc-bin/4.7.3" \
29 util/BuildFoundries /var/tmp/portage/sys-apps/groff-1.22.2/work/groff-1.22.2/font/devpdf \
30 '/var/tmp/portage/sys-apps/groff-1.22.2/work/groff-1.22.2/font/devps : /var/tmp/portage/sys-apps/groff-1.22.2/work/groff-1.22.2/font/devps' \
31 >> /var/tmp/portage/sys-apps/groff-1.22.2/work/groff-1.22.2/font/devpdf/download
32 Warning: line 28: Unable to locate font(s) URWGothicL-Demi,a010015l.pfb on the given path(s)
33 Warning: line 29: Unable to locate font(s) URWGothicL-DemiObli,a010035l.pfb on the given path(s)
34 Warning: line 30: Unable to locate font(s) URWGothicL-BookObli,a010033l.pfb on the given path(s)
35 Warning: line 31: Unable to locate font(s) URWGothicL-Book,a010013l.pfb on the given path(s)
36 Warning: line 32: Unable to locate font(s) URWBookmanL-DemiBold,b018015l.pfb on the given path(s)
37 Warning: line 33: Unable to locate font(s) URWBookmanL-DemiBoldItal,b018035l.pfb on the given path(s)
38 Warning: line 34: Unable to locate font(s) URWBookmanL-LighItal,b018032l.pfb on the given path(s)
39 Warning: line 35: Unable to locate font(s) URWBookmanL-Ligh,b018012l.pfb on the given path(s)
40 Copied grops font CB...
41 Copied grops font CBI...
42 Copied grops font CI...
43 Copied grops font CR...
44 Copied grops font EURO...
45 Copied grops font HB...
46 Copied grops font HBI...
47 Copied grops font HI...
48 Warning: line 44: Unable to locate font(s) NimbusSanL-BoldCond,n019044l.pfb on the given path(s)
49 Warning: line 45: Unable to locate font(s) NimbusSanL-BoldCondItal,n019064l.pfb on the given path(s)
50 Warning: line 46: Unable to locate font(s) NimbusSanL-ReguCondItal,n019063l.pfb on the given path(s)
51 Warning: line 47: Unable to locate font(s) NimbusSanL-ReguCond,n019043l.pfb on the given path(s)
52 Copied grops font HR...
53 Warning: line 49: Unable to locate font(s) CenturySchL-Bold,c059016l.pfb on the given path(s)
54 Warning: line 50: Unable to locate font(s) CenturySchL-BoldItal,c059036l.pfb on the given path(s)
55 Warning: line 51: Unable to locate font(s) CenturySchL-Ital,c059033l.pfb on the given path(s)
56 Warning: line 52: Unable to locate font(s) CenturySchL-Roma,c059013l.pfb on the given path(s)
57 Warning: line 53: Unable to locate font(s) URWPalladioL-Bold,p052004l.pfb on the given path(s)
58 Warning: line 54: Unable to locate font(s) URWPalladioL-BoldItal,p052024l.pfb on the given path(s)
59 Warning: line 55: Unable to locate font(s) URWPalladioL-Ital,p052023l.pfb on the given path(s)
60 Warning: line 56: Unable to locate font(s) URWPalladioL-Roma,p052003l.pfb on the given path(s)
61 Copied grops font S...
62 Copied grops font TB...
63 Copied grops font TBI...
64 Copied grops font TI...
65 Copied grops font TR...
66 Warning: line 62: Unable to locate font(s) URWChanceryL-MediItal,z003034l.pfb on the given path(s)
67 Copied grops font ZD...
68 Warning: line 77: Failed to create groff font 'U-AB' by running afmtodit
69 elapsed time: 0 seconds
70 Warning: line 78: Failed to create groff font 'U-ABI' by running afmtodit
71 Warning: line 79: Failed to create groff font 'U-AI' by running afmtodit
72 Warning: line 80: Failed to create groff font 'U-AR' by running afmtodit
73 Warning: line 81: Failed to create groff font 'U-BMB' by running afmtodit
74 Warning: line 82: Failed to create groff font 'U-BMBI' by running afmtodit
75 Warning: line 83: Failed to create groff font 'U-BMI' by running afmtodit
76 Warning: line 84: Failed to create groff font 'U-BMR' by running afmtodit
77 Warning: line 85: Failed to create groff font 'U-CB' by running afmtodit
78 Warning: line 86: Failed to create groff font 'U-CBI' by running afmtodit
79 Warning: line 87: Failed to create groff font 'U-CI' by running afmtodit
80 Warning: line 88: Failed to create groff font 'U-CR' by running afmtodit
81 Warning: line 89: Failed to create groff font 'U-HB' by running afmtodit
82 Warning: line 90: Failed to create groff font 'U-HBI' by running afmtodit
83 Warning: line 91: Failed to create groff font 'U-HI' by running afmtodit
84 Warning: line 92: Failed to create groff font 'U-HNB' by running afmtodit
85 Warning: line 93: Failed to create groff font 'U-HNBI' by running afmtodit
86 elapsed time: 1 seconds
87 Warning: line 94: Failed to create groff font 'U-HNI' by running afmtodit
88 Warning: line 95: Failed to create groff font 'U-HNR' by running afmtodit
89 Warning: line 96: Failed to create groff font 'U-HR' by running afmtodit
90 Warning: line 97: Failed to create groff font 'U-NB' by running afmtodit
91 Warning: line 98: Failed to create groff font 'U-NBI' by running afmtodit
92 Warning: line 99: Failed to create groff font 'U-NI' by running afmtodit
93 Warning: line 100: Failed to create groff font 'U-NR' by running afmtodit
94 Warning: line 101: Failed to create groff font 'U-PB' by running afmtodit
95 Warning: line 102: Failed to create groff font 'U-PBI' by running afmtodit
96 Warning: line 103: Failed to create groff font 'U-PI' by running afmtodit
97 Warning: line 104: Failed to create groff font 'U-PR' by running afmtodit
98 Warning: line 105: Failed to create groff font 'U-S' by running afmtodit
99 Warning: line 106: Failed to create groff font 'U-TB' by running afmtodit
100 Warning: line 107: Failed to create groff font 'U-TBI' by running afmtodit
101 Warning: line 108: Failed to create groff font 'U-TI' by running afmtodit
102 Warning: line 109: Failed to create groff font 'U-TR' by running afmtodit
103 Warning: line 110: Failed to create groff font 'U-ZCMI' by running afmtodit
104 Warning: line 111: Failed to create groff font 'U-ZD' by running afmtodit
105 make[2]: Leaving directory `/var/tmp/portage/sys-apps/groff-1.22.2/work/groff-1.22.2/font/devpdf'
106 elapsed time: 1 seconds
107 make[2]: Leaving directory `/var/tmp/portage/sys-apps/groff-1.22.2/work/groff-1.22.2/contrib/hdtbl'
108 make[1]: *** [contrib/hdtbl] Error 2
109 make[1]: Leaving directory `/var/tmp/portage/sys-apps/groff-1.22.2/work/groff-1.22.2'
110 make: *** [all] Error 2
111 * ERROR: sys-apps/groff-1.22.2::gentoo failed (compile phase):
112 * emake failed
113 *
114 * If you need support, post the output of `emerge --info '=sys-apps/groff-1.22.2::gentoo'`,
115 * the complete build log and the output of `emerge -pqv '=sys-apps/groff-1.22.2::gentoo'`.
116 * The complete build log is located at '/var/tmp/portage/sys-apps/groff-1.22.2/temp/build.log'.
117 * The ebuild environment file is located at '/var/tmp/portage/sys-apps/groff-1.22.2/temp/environment'.
118 * Working directory: '/var/tmp/portage/sys-apps/groff-1.22.2/work/groff-1.22.2'
119 * S: '/var/tmp/portage/sys-apps/groff-1.22.2/work/groff-1.22.2'
120
121 * Messages for package sys-apps/baselayout-2.2:
122
123 * The following users have non-existent shells!
124 * halt - /sbin/halt
125 * shutdown - /sbin/shutdown
126
127 * Messages for package sys-libs/timezone-data-2014d:
128
129 * You do not have TIMEZONE set in /etc/timezone.
130 * Skipping auto-update of /etc/localtime.
131
132 * Messages for package app-portage/portage-utils-0.53:
133
134 * /etc/portage/postsync.d/q-reinitialize has been installed for convenience
135 * If you wish for it to be automatically run at the end of every --sync:
136 * # chmod +x /etc/portage/postsync.d/q-reinitialize
137 * Normally this should only take a few seconds to run but file systems
138 * such as ext3 can take a lot longer. To disable, simply do:
139 * # chmod -x /etc/portage/postsync.d/q-reinitialize
140
141 * Messages for package sys-apps/sysvinit-2.88-r7:
142
143 * The last/lastb/mesg/mountpoint/sulogin/utmpdump/wall tools have been moved to
144 * sys-apps/util-linux. The pidof tool has been moved to sys-process/procps.
145
146 * Messages for package sys-libs/glibc-2.19-r1:
147
148 * Defaulting /etc/host.conf:multi to on
149 * Generating all locales; edit /etc/locale.gen to save time/space
150
151 * Messages for package sys-apps/less-457:
152
153 * lesspipe offers colorization options. Run 'lesspipe -h' for info.
154
155 * Messages for package sys-apps/coreutils-8.21:
156
157 * Make sure you run 'hash -r' in your active shells.
158 * You should also re-source your shell settings for LS_COLORS
159 * changes, such as: source /etc/profile
160
161 * Messages for package app-misc/ca-certificates-20130906-r1:
162
163 * You should run update-ca-certificates manually after etc-update
164
165 * Messages for package sys-apps/groff-1.22.2:
166
167 * ERROR: sys-apps/groff-1.22.2::gentoo failed (compile phase):
168 * emake failed
169 *
170 * If you need support, post the output of `emerge --info '=sys-apps/groff-1.22.2::gentoo'`,
171 * the complete build log and the output of `emerge -pqv '=sys-apps/groff-1.22.2::gentoo'`.
172 * The complete build log is located at '/var/tmp/portage/sys-apps/groff-1.22.2/temp/build.log'.
173 * The ebuild environment file is located at '/var/tmp/portage/sys-apps/groff-1.22.2/temp/environment'.
174 * Working directory: '/var/tmp/portage/sys-apps/groff-1.22.2/work/groff-1.22.2'
175 * S: '/var/tmp/portage/sys-apps/groff-1.22.2/work/groff-1.22.2'
176
177 !!! catalyst: run script failed.
178
179
180 Traceback (most recent call last):
181 File "modules/generic_stage_target.py", line 1244, in run_local
182 "run script failed.",env=self.env)
183 File "/usr/lib/catalyst/modules/catalyst_support.py", line 541, in cmd
184 raise CatalystError,myexc
185 CatalystError
186 None
187
188 !!! catalyst: Stage build aborting due to error.
189
190 Traceback (most recent call last):
191 File "/usr/lib/catalyst/catalyst", line 218, in build_target
192 mytarget.run()
193 File "modules/generic_stage_target.py", line 1304, in run
194 apply(getattr(self,x))
195 File "modules/generic_stage_target.py", line 1249, in run_local
196 raise CatalystError,"Stage build aborting due to error."
197 CatalystError
198 !!! catalyst: Error encountered during run of target stage3
199 Catalyst aborting....
200 lockfile does not exist '/var/tmp/catalyst/tmp/default/stage3-ppc64-64ul-20140831/.catalyst_lock'
201
202
203
204 Full build log at /tmp/catalyst-auto.1773/log/stage3-64ul.log