Gentoo Archives: gentoo-releng-autobuilds

From: catalyst@×××××××××××××××××.org
To: releng@g.o, gentoo-releng-autobuilds@l.g.o
Subject: [gentoo-releng-autobuilds] [amd64-auto] Catalyst non-fatal build error - installcd-stage2-minimal.spec
Date: Thu, 29 Oct 2015 07:06:16
Message-Id: 20151029070550.CC235267EE@nightheron.gentoo.org
*--
*  gcc -Wp,-MD,archival/libarchive/.lzo1x_d.o.d   -std=gnu99 -Iinclude -Ilibbb  -include include/autoconf.h -D_GNU_SOURCE -DNDEBUG -D_LARGEFILE_SOURCE -D_LARGEFILE64_SOURCE -D_FILE_OFFSET_BITS=64 -D"BB_VER=KBUILD_STR(1.20.2)" -DBB_BT=AUTOCONF_TIMESTAMP  -Wall -Wshadow -Wwrite-strings -Wundef -Wstrict-prototypes -Wunused -Wunused-parameter -Wunused-function -Wunused-value -Wmissing-prototypes -Wmissing-declarations -Wdeclaration-after-statement -Wold-style-definition -fno-builtin-strlen -finline-limit=0 -fomit-frame-pointer -ffunction-sections -fdata-sections -fno-guess-branch-probability -funsigned-char -static-libgcc -falign-functions=1 -falign-jumps=1 -falign-labels=1 -falign-loops=1 -Os     -D"KBUILD_STR(s)=#s" -D"KBUILD_BASENAME=KBUILD_STR(lzo1x_d)"  -D"KBUILD_MODNAME=KBUILD_STR(lzo1x_d)" -c -o archival/libarchive/lzo1x_d.o archival/libarchive/lzo1x_d.c
*  gcc -Wp,-MD,miscutils/.microcom.o.d   -std=gnu99 -Iinclude -Ilibbb  -include include/autoconf.h -D_GNU_SOURCE -DNDEBUG -D_LARGEFILE_SOURCE -D_LARGEFILE64_SOURCE -D_FILE_OFFSET_BITS=64 -D"BB_VER=KBUILD_STR(1.20.2)" -DBB_BT=AUTOCONF_TIMESTAMP  -Wall -Wshadow -Wwrite-strings -Wundef -Wstrict-prototypes -Wunused -Wunused-parameter -Wunused-function -Wunused-value -Wmissing-prototypes -Wmissing-declarations -Wdeclaration-after-statement -Wold-style-definition -fno-builtin-strlen -finline-limit=0 -fomit-frame-pointer -ffunction-sections -fdata-sections -fno-guess-branch-probability -funsigned-char -static-libgcc -falign-functions=1 -falign-jumps=1 -falign-labels=1 -falign-loops=1 -Os     -D"KBUILD_STR(s)=#s" -D"KBUILD_BASENAME=KBUILD_STR(microcom)"  -D"KBUILD_MODNAME=KBUILD_STR(microcom)" -c -o miscutils/microcom.o miscutils/microcom.c
*  gcc -Wp,-MD,networking/udhcp/.dhcpd.o.d   -std=gnu99 -Iinclude -Ilibbb  -include include/autoconf.h -D_GNU_SOURCE -DNDEBUG -D_LARGEFILE_SOURCE -D_LARGEFILE64_SOURCE -D_FILE_OFFSET_BITS=64 -D"BB_VER=KBUILD_STR(1.20.2)" -DBB_BT=AUTOCONF_TIMESTAMP  -Wall -Wshadow -Wwrite-strings -Wundef -Wstrict-prototypes -Wunused -Wunused-parameter -Wunused-function -Wunused-value -Wmissing-prototypes -Wmissing-declarations -Wdeclaration-after-statement -Wold-style-definition -fno-builtin-strlen -finline-limit=0 -fomit-frame-pointer -ffunction-sections -fdata-sections -fno-guess-branch-probability -funsigned-char -static-libgcc -falign-functions=1 -falign-jumps=1 -falign-labels=1 -falign-loops=1 -Os     -D"KBUILD_STR(s)=#s" -D"KBUILD_BASENAME=KBUILD_STR(dhcpd)"  -D"KBUILD_MODNAME=KBUILD_STR(dhcpd)" -c -o networking/udhcp/dhcpd.o networking/udhcp/dhcpd.c
*In file included from networking/interface.c:34:0:
*networking/interface.c: In function 'if_readlist_proc':
*include/libbb.h:171:30: warning: ignoring return value of 'fgets_unlocked', declared with attribute warn_unused_result [-Wunused-result]
* # define fgets(s, n, stream) fgets_unlocked(s, n, stream)
*                              ^
*networking/interface.c:572:2: note: in expansion of macro 'fgets'
*  fgets(buf, sizeof buf, fh); /* eat line */
*  ^
*include/libbb.h:171:30: warning: ignoring return value of 'fgets_unlocked', declared with attribute warn_unused_result [-Wunused-result]
*--
*                              ^
*networking/interface.c:573:2: note: in expansion of macro 'fgets'
*  fgets(buf, sizeof buf, fh);
*  ^
*miscutils/microcom.c: In function 'microcom_main':
*miscutils/microcom.c:152:4: warning: ignoring return value of 'write', declared with attribute warn_unused_result [-Wunused-result]
*--
*  gcc -Wp,-MD,coreutils/.sleep.o.d   -std=gnu99 -Iinclude -Ilibbb  -include include/autoconf.h -D_GNU_SOURCE -DNDEBUG -D_LARGEFILE_SOURCE -D_LARGEFILE64_SOURCE -D_FILE_OFFSET_BITS=64 -D"BB_VER=KBUILD_STR(1.20.2)" -DBB_BT=AUTOCONF_TIMESTAMP  -Wall -Wshadow -Wwrite-strings -Wundef -Wstrict-prototypes -Wunused -Wunused-parameter -Wunused-function -Wunused-value -Wmissing-prototypes -Wmissing-declarations -Wdeclaration-after-statement -Wold-style-definition -fno-builtin-strlen -finline-limit=0 -fomit-frame-pointer -ffunction-sections -fdata-sections -fno-guess-branch-probability -funsigned-char -static-libgcc -falign-functions=1 -falign-jumps=1 -falign-labels=1 -falign-loops=1 -Os     -D"KBUILD_STR(s)=#s" -D"KBUILD_BASENAME=KBUILD_STR(sleep)"  -D"KBUILD_MODNAME=KBUILD_STR(sleep)" -c -o coreutils/sleep.o coreutils/sleep.c
*  gcc -Wp,-MD,archival/libarchive/.seek_by_read.o.d   -std=gnu99 -Iinclude -Ilibbb  -include include/autoconf.h -D_GNU_SOURCE -DNDEBUG -D_LARGEFILE_SOURCE -D_LARGEFILE64_SOURCE -D_FILE_OFFSET_BITS=64 -D"BB_VER=KBUILD_STR(1.20.2)" -DBB_BT=AUTOCONF_TIMESTAMP  -Wall -Wshadow -Wwrite-strings -Wundef -Wstrict-prototypes -Wunused -Wunused-parameter -Wunused-function -Wunused-value -Wmissing-prototypes -Wmissing-declarations -Wdeclaration-after-statement -Wold-style-definition -fno-builtin-strlen -finline-limit=0 -fomit-frame-pointer -ffunction-sections -fdata-sections -fno-guess-branch-probability -funsigned-char -static-libgcc -falign-functions=1 -falign-jumps=1 -falign-labels=1 -falign-loops=1 -Os     -D"KBUILD_STR(s)=#s" -D"KBUILD_BASENAME=KBUILD_STR(seek_by_read)"  -D"KBUILD_MODNAME=KBUILD_STR(seek_by_read)" -c -o archival/libarchive/seek_by_read.o archival/libarchive/seek_by_read.c
*  gcc -Wp,-MD,networking/udhcp/.dhcprelay.o.d   -std=gnu99 -Iinclude -Ilibbb  -include include/autoconf.h -D_GNU_SOURCE -DNDEBUG -D_LARGEFILE_SOURCE -D_LARGEFILE64_SOURCE -D_FILE_OFFSET_BITS=64 -D"BB_VER=KBUILD_STR(1.20.2)" -DBB_BT=AUTOCONF_TIMESTAMP  -Wall -Wshadow -Wwrite-strings -Wundef -Wstrict-prototypes -Wunused -Wunused-parameter -Wunused-function -Wunused-value -Wmissing-prototypes -Wmissing-declarations -Wdeclaration-after-statement -Wold-style-definition -fno-builtin-strlen -finline-limit=0 -fomit-frame-pointer -ffunction-sections -fdata-sections -fno-guess-branch-probability -funsigned-char -static-libgcc -falign-functions=1 -falign-jumps=1 -falign-labels=1 -falign-loops=1 -Os     -D"KBUILD_STR(s)=#s" -D"KBUILD_BASENAME=KBUILD_STR(dhcprelay)"  -D"KBUILD_MODNAME=KBUILD_STR(dhcprelay)" -c -o networking/udhcp/dhcprelay.o networking/udhcp/dhcprelay.c
*  gcc -Wp,-MD,miscutils/.timeout.o.d   -std=gnu99 -Iinclude -Ilibbb  -include include/autoconf.h -D_GNU_SOURCE -DNDEBUG -D_LARGEFILE_SOURCE -D_LARGEFILE64_SOURCE -D_FILE_OFFSET_BITS=64 -D"BB_VER=KBUILD_STR(1.20.2)" -DBB_BT=AUTOCONF_TIMESTAMP  -Wall -Wshadow -Wwrite-strings -Wundef -Wstrict-prototypes -Wunused -Wunused-parameter -Wunused-function -Wunused-value -Wmissing-prototypes -Wmissing-declarations -Wdeclaration-after-statement -Wold-style-definition -fno-builtin-strlen -finline-limit=0 -fomit-frame-pointer -ffunction-sections -fdata-sections -fno-guess-branch-probability -funsigned-char -static-libgcc -falign-functions=1 -falign-jumps=1 -falign-labels=1 -falign-loops=1 -Os     -D"KBUILD_STR(s)=#s" -D"KBUILD_BASENAME=KBUILD_STR(timeout)"  -D"KBUILD_MODNAME=KBUILD_STR(timeout)" -c -o miscutils/timeout.o miscutils/timeout.c
*networking/nbd-client.c: In function 'nbdclient_main':
*networking/nbd-client.c:133:4: warning: ignoring return value of 'daemon', declared with attribute warn_unused_result [-Wunused-result]
*--
*  gcc -Wp,-MD,printutils/.lpd.o.d   -std=gnu99 -Iinclude -Ilibbb  -include include/autoconf.h -D_GNU_SOURCE -DNDEBUG -D_LARGEFILE_SOURCE -D_LARGEFILE64_SOURCE -D_FILE_OFFSET_BITS=64 -D"BB_VER=KBUILD_STR(1.20.2)" -DBB_BT=AUTOCONF_TIMESTAMP  -Wall -Wshadow -Wwrite-strings -Wundef -Wstrict-prototypes -Wunused -Wunused-parameter -Wunused-function -Wunused-value -Wmissing-prototypes -Wmissing-declarations -Wdeclaration-after-statement -Wold-style-definition -fno-builtin-strlen -finline-limit=0 -fomit-frame-pointer -ffunction-sections -fdata-sections -fno-guess-branch-probability -funsigned-char -static-libgcc -falign-functions=1 -falign-jumps=1 -falign-labels=1 -falign-loops=1 -Os     -D"KBUILD_STR(s)=#s" -D"KBUILD_BASENAME=KBUILD_STR(lpd)"  -D"KBUILD_MODNAME=KBUILD_STR(lpd)" -c -o printutils/lpd.o printutils/lpd.c
*  gcc -Wp,-MD,printutils/.lpr.o.d   -std=gnu99 -Iinclude -Ilibbb  -include include/autoconf.h -D_GNU_SOURCE -DNDEBUG -D_LARGEFILE_SOURCE -D_LARGEFILE64_SOURCE -D_FILE_OFFSET_BITS=64 -D"BB_VER=KBUILD_STR(1.20.2)" -DBB_BT=AUTOCONF_TIMESTAMP  -Wall -Wshadow -Wwrite-strings -Wundef -Wstrict-prototypes -Wunused -Wunused-parameter -Wunused-function -Wunused-value -Wmissing-prototypes -Wmissing-declarations -Wdeclaration-after-statement -Wold-style-definition -fno-builtin-strlen -finline-limit=0 -fomit-frame-pointer -ffunction-sections -fdata-sections -fno-guess-branch-probability -funsigned-char -static-libgcc -falign-functions=1 -falign-jumps=1 -falign-labels=1 -falign-loops=1 -Os     -D"KBUILD_STR(s)=#s" -D"KBUILD_BASENAME=KBUILD_STR(lpr)"  -D"KBUILD_MODNAME=KBUILD_STR(lpr)" -c -o printutils/lpr.o printutils/lpr.c
*  gcc -Wp,-MD,networking/udhcp/.dumpleases.o.d   -std=gnu99 -Iinclude -Ilibbb  -include include/autoconf.h -D_GNU_SOURCE -DNDEBUG -D_LARGEFILE_SOURCE -D_LARGEFILE64_SOURCE -D_FILE_OFFSET_BITS=64 -D"BB_VER=KBUILD_STR(1.20.2)" -DBB_BT=AUTOCONF_TIMESTAMP  -Wall -Wshadow -Wwrite-strings -Wundef -Wstrict-prototypes -Wunused -Wunused-parameter -Wunused-function -Wunused-value -Wmissing-prototypes -Wmissing-declarations -Wdeclaration-after-statement -Wold-style-definition -fno-builtin-strlen -finline-limit=0 -fomit-frame-pointer -ffunction-sections -fdata-sections -fno-guess-branch-probability -funsigned-char -static-libgcc -falign-functions=1 -falign-jumps=1 -falign-labels=1 -falign-loops=1 -Os     -D"KBUILD_STR(s)=#s" -D"KBUILD_BASENAME=KBUILD_STR(dumpleases)"  -D"KBUILD_MODNAME=KBUILD_STR(dumpleases)" -c -o networking/udhcp/dumpleases.o networking/udhcp/dumpleases.c
*  gcc -Wp,-MD,libbb/.fclose_nonstdin.o.d   -std=gnu99 -Iinclude -Ilibbb  -include include/autoconf.h -D_GNU_SOURCE -DNDEBUG -D_LARGEFILE_SOURCE -D_LARGEFILE64_SOURCE -D_FILE_OFFSET_BITS=64 -D"BB_VER=KBUILD_STR(1.20.2)" -DBB_BT=AUTOCONF_TIMESTAMP  -Wall -Wshadow -Wwrite-strings -Wundef -Wstrict-prototypes -Wunused -Wunused-parameter -Wunused-function -Wunused-value -Wmissing-prototypes -Wmissing-declarations -Wdeclaration-after-statement -Wold-style-definition -fno-builtin-strlen -finline-limit=0 -fomit-frame-pointer -ffunction-sections -fdata-sections -fno-guess-branch-probability -funsigned-char -static-libgcc -falign-functions=1 -falign-jumps=1 -falign-labels=1 -falign-loops=1 -Os     -D"KBUILD_STR(s)=#s" -D"KBUILD_BASENAME=KBUILD_STR(fclose_nonstdin)"  -D"KBUILD_MODNAME=KBUILD_STR(fclose_nonstdin)" -c -o libbb/fclose_nonstdin.o libbb/fclose_nonstdin.c
*printutils/lpr.c: In function 'lpqr_main':
*printutils/lpr.c:252:3: warning: ignoring return value of 'write', declared with attribute warn_unused_result [-Wunused-result]
*--
*  gcc -Wp,-MD,coreutils/.uname.o.d   -std=gnu99 -Iinclude -Ilibbb  -include include/autoconf.h -D_GNU_SOURCE -DNDEBUG -D_LARGEFILE_SOURCE -D_LARGEFILE64_SOURCE -D_FILE_OFFSET_BITS=64 -D"BB_VER=KBUILD_STR(1.20.2)" -DBB_BT=AUTOCONF_TIMESTAMP  -Wall -Wshadow -Wwrite-strings -Wundef -Wstrict-prototypes -Wunused -Wunused-parameter -Wunused-function -Wunused-value -Wmissing-prototypes -Wmissing-declarations -Wdeclaration-after-statement -Wold-style-definition -fno-builtin-strlen -finline-limit=0 -fomit-frame-pointer -ffunction-sections -fdata-sections -fno-guess-branch-probability -funsigned-char -static-libgcc -falign-functions=1 -falign-jumps=1 -falign-labels=1 -falign-loops=1 -Os     -D"KBUILD_STR(s)=#s" -D"KBUILD_BASENAME=KBUILD_STR(uname)"  -D"KBUILD_MODNAME=KBUILD_STR(uname)" -c -o coreutils/uname.o coreutils/uname.c
*  gcc -Wp,-MD,libbb/.getopt32.o.d   -std=gnu99 -Iinclude -Ilibbb  -include include/autoconf.h -D_GNU_SOURCE -DNDEBUG -D_LARGEFILE_SOURCE -D_LARGEFILE64_SOURCE -D_FILE_OFFSET_BITS=64 -D"BB_VER=KBUILD_STR(1.20.2)" -DBB_BT=AUTOCONF_TIMESTAMP  -Wall -Wshadow -Wwrite-strings -Wundef -Wstrict-prototypes -Wunused -Wunused-parameter -Wunused-function -Wunused-value -Wmissing-prototypes -Wmissing-declarations -Wdeclaration-after-statement -Wold-style-definition -fno-builtin-strlen -finline-limit=0 -fomit-frame-pointer -ffunction-sections -fdata-sections -fno-guess-branch-probability -funsigned-char -static-libgcc -falign-functions=1 -falign-jumps=1 -falign-labels=1 -falign-loops=1 -Os     -D"KBUILD_STR(s)=#s" -D"KBUILD_BASENAME=KBUILD_STR(getopt32)"  -D"KBUILD_MODNAME=KBUILD_STR(getopt32)" -c -o libbb/getopt32.o libbb/getopt32.c
*  gcc -Wp,-MD,procps/.pstree.o.d   -std=gnu99 -Iinclude -Ilibbb  -include include/autoconf.h -D_GNU_SOURCE -DNDEBUG -D_LARGEFILE_SOURCE -D_LARGEFILE64_SOURCE -D_FILE_OFFSET_BITS=64 -D"BB_VER=KBUILD_STR(1.20.2)" -DBB_BT=AUTOCONF_TIMESTAMP  -Wall -Wshadow -Wwrite-strings -Wundef -Wstrict-prototypes -Wunused -Wunused-parameter -Wunused-function -Wunused-value -Wmissing-prototypes -Wmissing-declarations -Wdeclaration-after-statement -Wold-style-definition -fno-builtin-strlen -finline-limit=0 -fomit-frame-pointer -ffunction-sections -fdata-sections -fno-guess-branch-probability -funsigned-char -static-libgcc -falign-functions=1 -falign-jumps=1 -falign-labels=1 -falign-loops=1 -Os     -D"KBUILD_STR(s)=#s" -D"KBUILD_BASENAME=KBUILD_STR(pstree)"  -D"KBUILD_MODNAME=KBUILD_STR(pstree)" -c -o procps/pstree.o procps/pstree.c
*  gcc -Wp,-MD,procps/.pwdx.o.d   -std=gnu99 -Iinclude -Ilibbb  -include include/autoconf.h -D_GNU_SOURCE -DNDEBUG -D_LARGEFILE_SOURCE -D_LARGEFILE64_SOURCE -D_FILE_OFFSET_BITS=64 -D"BB_VER=KBUILD_STR(1.20.2)" -DBB_BT=AUTOCONF_TIMESTAMP  -Wall -Wshadow -Wwrite-strings -Wundef -Wstrict-prototypes -Wunused -Wunused-parameter -Wunused-function -Wunused-value -Wmissing-prototypes -Wmissing-declarations -Wdeclaration-after-statement -Wold-style-definition -fno-builtin-strlen -finline-limit=0 -fomit-frame-pointer -ffunction-sections -fdata-sections -fno-guess-branch-probability -funsigned-char -static-libgcc -falign-functions=1 -falign-jumps=1 -falign-labels=1 -falign-loops=1 -Os     -D"KBUILD_STR(s)=#s" -D"KBUILD_BASENAME=KBUILD_STR(pwdx)"  -D"KBUILD_MODNAME=KBUILD_STR(pwdx)" -c -o procps/pwdx.o procps/pwdx.c
*shell/ash.c: In function 'evalcommand':
*shell/ash.c:9305:15: warning: variable 'oldpath' set but not used [-Wunused-but-set-variable]
*--
*  gcc -Wp,-MD,shell/.math.o.d   -std=gnu99 -Iinclude -Ilibbb  -include include/autoconf.h -D_GNU_SOURCE -DNDEBUG -D_LARGEFILE_SOURCE -D_LARGEFILE64_SOURCE -D_FILE_OFFSET_BITS=64 -D"BB_VER=KBUILD_STR(1.20.2)" -DBB_BT=AUTOCONF_TIMESTAMP  -Wall -Wshadow -Wwrite-strings -Wundef -Wstrict-prototypes -Wunused -Wunused-parameter -Wunused-function -Wunused-value -Wmissing-prototypes -Wmissing-declarations -Wdeclaration-after-statement -Wold-style-definition -fno-builtin-strlen -finline-limit=0 -fomit-frame-pointer -ffunction-sections -fdata-sections -fno-guess-branch-probability -funsigned-char -static-libgcc -falign-functions=1 -falign-jumps=1 -falign-labels=1 -falign-loops=1 -Os     -D"KBUILD_STR(s)=#s" -D"KBUILD_BASENAME=KBUILD_STR(math)"  -D"KBUILD_MODNAME=KBUILD_STR(math)" -c -o shell/math.o shell/math.c
*  gcc -Wp,-MD,util-linux/.dmesg.o.d   -std=gnu99 -Iinclude -Ilibbb  -include include/autoconf.h -D_GNU_SOURCE -DNDEBUG -D_LARGEFILE_SOURCE -D_LARGEFILE64_SOURCE -D_FILE_OFFSET_BITS=64 -D"BB_VER=KBUILD_STR(1.20.2)" -DBB_BT=AUTOCONF_TIMESTAMP  -Wall -Wshadow -Wwrite-strings -Wundef -Wstrict-prototypes -Wunused -Wunused-parameter -Wunused-function -Wunused-value -Wmissing-prototypes -Wmissing-declarations -Wdeclaration-after-statement -Wold-style-definition -fno-builtin-strlen -finline-limit=0 -fomit-frame-pointer -ffunction-sections -fdata-sections -fno-guess-branch-probability -funsigned-char -static-libgcc -falign-functions=1 -falign-jumps=1 -falign-labels=1 -falign-loops=1 -Os     -D"KBUILD_STR(s)=#s" -D"KBUILD_BASENAME=KBUILD_STR(dmesg)"  -D"KBUILD_MODNAME=KBUILD_STR(dmesg)" -c -o util-linux/dmesg.o util-linux/dmesg.c
*  gcc -Wp,-MD,shell/.shell_common.o.d   -std=gnu99 -Iinclude -Ilibbb  -include include/autoconf.h -D_GNU_SOURCE -DNDEBUG -D_LARGEFILE_SOURCE -D_LARGEFILE64_SOURCE -D_FILE_OFFSET_BITS=64 -D"BB_VER=KBUILD_STR(1.20.2)" -DBB_BT=AUTOCONF_TIMESTAMP  -Wall -Wshadow -Wwrite-strings -Wundef -Wstrict-prototypes -Wunused -Wunused-parameter -Wunused-function -Wunused-value -Wmissing-prototypes -Wmissing-declarations -Wdeclaration-after-statement -Wold-style-definition -fno-builtin-strlen -finline-limit=0 -fomit-frame-pointer -ffunction-sections -fdata-sections -fno-guess-branch-probability -funsigned-char -static-libgcc -falign-functions=1 -falign-jumps=1 -falign-labels=1 -falign-loops=1 -Os     -D"KBUILD_STR(s)=#s" -D"KBUILD_BASENAME=KBUILD_STR(shell_common)"  -D"KBUILD_MODNAME=KBUILD_STR(shell_common)" -c -o shell/shell_common.o shell/shell_common.c
*  gcc -Wp,-MD,util-linux/volume_id/.cramfs.o.d   -std=gnu99 -Iinclude -Ilibbb  -include include/autoconf.h -D_GNU_SOURCE -DNDEBUG -D_LARGEFILE_SOURCE -D_LARGEFILE64_SOURCE -D_FILE_OFFSET_BITS=64 -D"BB_VER=KBUILD_STR(1.20.2)" -DBB_BT=AUTOCONF_TIMESTAMP  -Wall -Wshadow -Wwrite-strings -Wundef -Wstrict-prototypes -Wunused -Wunused-parameter -Wunused-function -Wunused-value -Wmissing-prototypes -Wmissing-declarations -Wdeclaration-after-statement -Wold-style-definition -fno-builtin-strlen -finline-limit=0 -fomit-frame-pointer -ffunction-sections -fdata-sections -fno-guess-branch-probability -funsigned-char -static-libgcc -falign-functions=1 -falign-jumps=1 -falign-labels=1 -falign-loops=1 -Os     -D"KBUILD_STR(s)=#s" -D"KBUILD_BASENAME=KBUILD_STR(cramfs)"  -D"KBUILD_MODNAME=KBUILD_STR(cramfs)" -c -o util-linux/volume_id/cramfs.o util-linux/volume_id/cramfs.c
*libbb/hash_md5_sha.c: In function 'common64_end':
*libbb/hash_md5_sha.c:82:4: warning: dereferencing type-punned pointer will break strict-aliasing rules [-Wstrict-aliasing]
*    *(uint64_t *) (&ctx->wbuffer[64 - 8]) = t;
*    ^
*libbb/hash_md5_sha.c: In function 'sha512_end':
*libbb/hash_md5_sha.c:881:4: warning: dereferencing type-punned pointer will break strict-aliasing rules [-Wstrict-aliasing]
*    *(uint64_t *) (&ctx->wbuffer[128 - 8]) = t;
*    ^
*libbb/hash_md5_sha.c:884:4: warning: dereferencing type-punned pointer will break strict-aliasing rules [-Wstrict-aliasing]
*--
*  gcc -Wp,-MD,libbb/.kernel_version.o.d   -std=gnu99 -Iinclude -Ilibbb  -include include/autoconf.h -D_GNU_SOURCE -DNDEBUG -D_LARGEFILE_SOURCE -D_LARGEFILE64_SOURCE -D_FILE_OFFSET_BITS=64 -D"BB_VER=KBUILD_STR(1.20.2)" -DBB_BT=AUTOCONF_TIMESTAMP  -Wall -Wshadow -Wwrite-strings -Wundef -Wstrict-prototypes -Wunused -Wunused-parameter -Wunused-function -Wunused-value -Wmissing-prototypes -Wmissing-declarations -Wdeclaration-after-statement -Wold-style-definition -fno-builtin-strlen -finline-limit=0 -fomit-frame-pointer -ffunction-sections -fdata-sections -fno-guess-branch-probability -funsigned-char -static-libgcc -falign-functions=1 -falign-jumps=1 -falign-labels=1 -falign-loops=1 -Os     -D"KBUILD_STR(s)=#s" -D"KBUILD_BASENAME=KBUILD_STR(kernel_version)"  -D"KBUILD_MODNAME=KBUILD_STR(kernel_version)" -c -o libbb/kernel_version.o libbb/kernel_version.c
*  gcc -Wp,-MD,util-linux/volume_id/.reiserfs.o.d   -std=gnu99 -Iinclude -Ilibbb  -include include/autoconf.h -D_GNU_SOURCE -DNDEBUG -D_LARGEFILE_SOURCE -D_LARGEFILE64_SOURCE -D_FILE_OFFSET_BITS=64 -D"BB_VER=KBUILD_STR(1.20.2)" -DBB_BT=AUTOCONF_TIMESTAMP  -Wall -Wshadow -Wwrite-strings -Wundef -Wstrict-prototypes -Wunused -Wunused-parameter -Wunused-function -Wunused-value -Wmissing-prototypes -Wmissing-declarations -Wdeclaration-after-statement -Wold-style-definition -fno-builtin-strlen -finline-limit=0 -fomit-frame-pointer -ffunction-sections -fdata-sections -fno-guess-branch-probability -funsigned-char -static-libgcc -falign-functions=1 -falign-jumps=1 -falign-labels=1 -falign-loops=1 -Os     -D"KBUILD_STR(s)=#s" -D"KBUILD_BASENAME=KBUILD_STR(reiserfs)"  -D"KBUILD_MODNAME=KBUILD_STR(reiserfs)" -c -o util-linux/volume_id/reiserfs.o util-linux/volume_id/reiserfs.c
*  gcc -Wp,-MD,util-linux/volume_id/.romfs.o.d   -std=gnu99 -Iinclude -Ilibbb  -include include/autoconf.h -D_GNU_SOURCE -DNDEBUG -D_LARGEFILE_SOURCE -D_LARGEFILE64_SOURCE -D_FILE_OFFSET_BITS=64 -D"BB_VER=KBUILD_STR(1.20.2)" -DBB_BT=AUTOCONF_TIMESTAMP  -Wall -Wshadow -Wwrite-strings -Wundef -Wstrict-prototypes -Wunused -Wunused-parameter -Wunused-function -Wunused-value -Wmissing-prototypes -Wmissing-declarations -Wdeclaration-after-statement -Wold-style-definition -fno-builtin-strlen -finline-limit=0 -fomit-frame-pointer -ffunction-sections -fdata-sections -fno-guess-branch-probability -funsigned-char -static-libgcc -falign-functions=1 -falign-jumps=1 -falign-labels=1 -falign-loops=1 -Os     -D"KBUILD_STR(s)=#s" -D"KBUILD_BASENAME=KBUILD_STR(romfs)"  -D"KBUILD_MODNAME=KBUILD_STR(romfs)" -c -o util-linux/volume_id/romfs.o util-linux/volume_id/romfs.c
*  gcc -Wp,-MD,util-linux/.mdStart.o.d   -std=gnu99 -Iinclude -Ilibbb  -include include/autoconf.h -D_GNU_SOURCE -DNDEBUG -D_LARGEFILE_SOURCE -D_LARGEFILE64_SOURCE -D_FILE_OFFSET_BITS=64 -D"BB_VER=KBUILD_STR(1.20.2)" -DBB_BT=AUTOCONF_TIMESTAMP  -Wall -Wshadow -Wwrite-strings -Wundef -Wstrict-prototypes -Wunused -Wunused-parameter -Wunused-function -Wunused-value -Wmissing-prototypes -Wmissing-declarations -Wdeclaration-after-statement -Wold-style-definition -fno-builtin-strlen -finline-limit=0 -fomit-frame-pointer -ffunction-sections -fdata-sections -fno-guess-branch-probability -funsigned-char -static-libgcc -falign-functions=1 -falign-jumps=1 -falign-labels=1 -falign-loops=1 -Os     -D"KBUILD_STR(s)=#s" -D"KBUILD_BASENAME=KBUILD_STR(mdStart)"  -D"KBUILD_MODNAME=KBUILD_STR(mdStart)" -c -o util-linux/mdStart.o util-linux/mdStart.c
*  gcc -Wp,-MD,libbb/.last_char_is.o.d   -std=gnu99 -Iinclude -Ilibbb  -include include/autoconf.h -D_GNU_SOURCE -DNDEBUG -D_LARGEFILE_SOURCE -D_LARGEFILE64_SOURCE -D_FILE_OFFSET_BITS=64 -D"BB_VER=KBUILD_STR(1.20.2)" -DBB_BT=AUTOCONF_TIMESTAMP  -Wall -Wshadow -Wwrite-strings -Wundef -Wstrict-prototypes -Wunused -Wunused-parameter -Wunused-function -Wunused-value -Wmissing-prototypes -Wmissing-declarations -Wdeclaration-after-statement -Wold-style-definition -fno-builtin-strlen -finline-limit=0 -fomit-frame-pointer -ffunction-sections -fdata-sections -fno-guess-branch-probability -funsigned-char -static-libgcc -falign-functions=1 -falign-jumps=1 -falign-labels=1 -falign-loops=1 -Os     -D"KBUILD_STR(s)=#s" -D"KBUILD_BASENAME=KBUILD_STR(last_char_is)"  -D"KBUILD_MODNAME=KBUILD_STR(last_char_is)" -c -o libbb/last_char_is.o libbb/last_char_is.c
*util-linux/mdStart.c:37:1: warning: no previous prototype for 'mdstart_main' [-Wmissing-prototypes]
* mdstart_main(int argc, char *argv[])
* ^
*util-linux/mdStart.c: In function 'mdstart_main':
*util-linux/mdStart.c:43:3: warning: implicit declaration of function 'bb_show_usage' [-Wimplicit-function-declaration]
*   bb_show_usage();
*   ^
*util-linux/mdStart.c:48:3: warning: implicit declaration of function 'sscanf' [-Wimplicit-function-declaration]
*   if(sscanf(argv[i], "%d", &part) == 1)
*   ^
*util-linux/mdStart.c:48:6: warning: incompatible implicit declaration of built-in function 'sscanf'
*   if(sscanf(argv[i], "%d", &part) == 1)
*      ^
*util-linux/mdStart.c:55:4: warning: implicit declaration of function 'close' [-Wimplicit-function-declaration]
*    close(fd);
*    ^
*util-linux/mdStart.c:58:4: warning: implicit declaration of function 'printf' [-Wimplicit-function-declaration]
*    printf("Error: Failed to open %s!
", argv[i]);
*    ^
*util-linux/mdStart.c:58:4: warning: incompatible implicit declaration of built-in function 'printf'
*--
*  gcc -Wp,-MD,util-linux/volume_id/.sysv.o.d   -std=gnu99 -Iinclude -Ilibbb  -include include/autoconf.h -D_GNU_SOURCE -DNDEBUG -D_LARGEFILE_SOURCE -D_LARGEFILE64_SOURCE -D_FILE_OFFSET_BITS=64 -D"BB_VER=KBUILD_STR(1.20.2)" -DBB_BT=AUTOCONF_TIMESTAMP  -Wall -Wshadow -Wwrite-strings -Wundef -Wstrict-prototypes -Wunused -Wunused-parameter -Wunused-function -Wunused-value -Wmissing-prototypes -Wmissing-declarations -Wdeclaration-after-statement -Wold-style-definition -fno-builtin-strlen -finline-limit=0 -fomit-frame-pointer -ffunction-sections -fdata-sections -fno-guess-branch-probability -funsigned-char -static-libgcc -falign-functions=1 -falign-jumps=1 -falign-labels=1 -falign-loops=1 -Os     -D"KBUILD_STR(s)=#s" -D"KBUILD_BASENAME=KBUILD_STR(sysv)"  -D"KBUILD_MODNAME=KBUILD_STR(sysv)" -c -o util-linux/volume_id/sysv.o util-linux/volume_id/sysv.c
*  gcc -Wp,-MD,util-linux/volume_id/.udf.o.d   -std=gnu99 -Iinclude -Ilibbb  -include include/autoconf.h -D_GNU_SOURCE -DNDEBUG -D_LARGEFILE_SOURCE -D_LARGEFILE64_SOURCE -D_FILE_OFFSET_BITS=64 -D"BB_VER=KBUILD_STR(1.20.2)" -DBB_BT=AUTOCONF_TIMESTAMP  -Wall -Wshadow -Wwrite-strings -Wundef -Wstrict-prototypes -Wunused -Wunused-parameter -Wunused-function -Wunused-value -Wmissing-prototypes -Wmissing-declarations -Wdeclaration-after-statement -Wold-style-definition -fno-builtin-strlen -finline-limit=0 -fomit-frame-pointer -ffunction-sections -fdata-sections -fno-guess-branch-probability -funsigned-char -static-libgcc -falign-functions=1 -falign-jumps=1 -falign-labels=1 -falign-loops=1 -Os     -D"KBUILD_STR(s)=#s" -D"KBUILD_BASENAME=KBUILD_STR(udf)"  -D"KBUILD_MODNAME=KBUILD_STR(udf)" -c -o util-linux/volume_id/udf.o util-linux/volume_id/udf.c
*  gcc -Wp,-MD,libbb/.login.o.d   -std=gnu99 -Iinclude -Ilibbb  -include include/autoconf.h -D_GNU_SOURCE -DNDEBUG -D_LARGEFILE_SOURCE -D_LARGEFILE64_SOURCE -D_FILE_OFFSET_BITS=64 -D"BB_VER=KBUILD_STR(1.20.2)" -DBB_BT=AUTOCONF_TIMESTAMP  -Wall -Wshadow -Wwrite-strings -Wundef -Wstrict-prototypes -Wunused -Wunused-parameter -Wunused-function -Wunused-value -Wmissing-prototypes -Wmissing-declarations -Wdeclaration-after-statement -Wold-style-definition -fno-builtin-strlen -finline-limit=0 -fomit-frame-pointer -ffunction-sections -fdata-sections -fno-guess-branch-probability -funsigned-char -static-libgcc -falign-functions=1 -falign-jumps=1 -falign-labels=1 -falign-loops=1 -Os     -D"KBUILD_STR(s)=#s" -D"KBUILD_BASENAME=KBUILD_STR(login)"  -D"KBUILD_MODNAME=KBUILD_STR(login)" -c -o libbb/login.o libbb/login.c
*  gcc -Wp,-MD,util-linux/volume_id/.util.o.d   -std=gnu99 -Iinclude -Ilibbb  -include include/autoconf.h -D_GNU_SOURCE -DNDEBUG -D_LARGEFILE_SOURCE -D_LARGEFILE64_SOURCE -D_FILE_OFFSET_BITS=64 -D"BB_VER=KBUILD_STR(1.20.2)" -DBB_BT=AUTOCONF_TIMESTAMP  -Wall -Wshadow -Wwrite-strings -Wundef -Wstrict-prototypes -Wunused -Wunused-parameter -Wunused-function -Wunused-value -Wmissing-prototypes -Wmissing-declarations -Wdeclaration-after-statement -Wold-style-definition -fno-builtin-strlen -finline-limit=0 -fomit-frame-pointer -ffunction-sections -fdata-sections -fno-guess-branch-probability -funsigned-char -static-libgcc -falign-functions=1 -falign-jumps=1 -falign-labels=1 -falign-loops=1 -Os     -D"KBUILD_STR(s)=#s" -D"KBUILD_BASENAME=KBUILD_STR(util)"  -D"KBUILD_MODNAME=KBUILD_STR(util)" -c -o util-linux/volume_id/util.o util-linux/volume_id/util.c
*util-linux/mdev.c: In function 'make_device':
*util-linux/mdev.c:564:5: warning: ignoring return value of 'symlink', declared with attribute warn_unused_result [-Wunused-result]
*     symlink(node_name, "root");
*     ^
*util-linux/mdev.c:567:5: warning: ignoring return value of 'chown', declared with attribute warn_unused_result [-Wunused-result]
*     chown(node_name, rule->ugid.uid, rule->ugid.gid);
*     ^
*util-linux/mdev.c:574:6: warning: ignoring return value of 'symlink', declared with attribute warn_unused_result [-Wunused-result]
*--
*  gcc -Wp,-MD,libbb/.update_passwd.o.d   -std=gnu99 -Iinclude -Ilibbb  -include include/autoconf.h -D_GNU_SOURCE -DNDEBUG -D_LARGEFILE_SOURCE -D_LARGEFILE64_SOURCE -D_FILE_OFFSET_BITS=64 -D"BB_VER=KBUILD_STR(1.20.2)" -DBB_BT=AUTOCONF_TIMESTAMP  -Wall -Wshadow -Wwrite-strings -Wundef -Wstrict-prototypes -Wunused -Wunused-parameter -Wunused-function -Wunused-value -Wmissing-prototypes -Wmissing-declarations -Wdeclaration-after-statement -Wold-style-definition -fno-builtin-strlen -finline-limit=0 -fomit-frame-pointer -ffunction-sections -fdata-sections -fno-guess-branch-probability -funsigned-char -static-libgcc -falign-functions=1 -falign-jumps=1 -falign-labels=1 -falign-loops=1 -Os     -D"KBUILD_STR(s)=#s" -D"KBUILD_BASENAME=KBUILD_STR(update_passwd)"  -D"KBUILD_MODNAME=KBUILD_STR(update_passwd)" -c -o libbb/update_passwd.o libbb/update_passwd.c
*  gcc -Wp,-MD,libbb/.uuencode.o.d   -std=gnu99 -Iinclude -Ilibbb  -include include/autoconf.h -D_GNU_SOURCE -DNDEBUG -D_LARGEFILE_SOURCE -D_LARGEFILE64_SOURCE -D_FILE_OFFSET_BITS=64 -D"BB_VER=KBUILD_STR(1.20.2)" -DBB_BT=AUTOCONF_TIMESTAMP  -Wall -Wshadow -Wwrite-strings -Wundef -Wstrict-prototypes -Wunused -Wunused-parameter -Wunused-function -Wunused-value -Wmissing-prototypes -Wmissing-declarations -Wdeclaration-after-statement -Wold-style-definition -fno-builtin-strlen -finline-limit=0 -fomit-frame-pointer -ffunction-sections -fdata-sections -fno-guess-branch-probability -funsigned-char -static-libgcc -falign-functions=1 -falign-jumps=1 -falign-labels=1 -falign-loops=1 -Os     -D"KBUILD_STR(s)=#s" -D"KBUILD_BASENAME=KBUILD_STR(uuencode)"  -D"KBUILD_MODNAME=KBUILD_STR(uuencode)" -c -o libbb/uuencode.o libbb/uuencode.c
*  gcc -Wp,-MD,libbb/.vdprintf.o.d   -std=gnu99 -Iinclude -Ilibbb  -include include/autoconf.h -D_GNU_SOURCE -DNDEBUG -D_LARGEFILE_SOURCE -D_LARGEFILE64_SOURCE -D_FILE_OFFSET_BITS=64 -D"BB_VER=KBUILD_STR(1.20.2)" -DBB_BT=AUTOCONF_TIMESTAMP  -Wall -Wshadow -Wwrite-strings -Wundef -Wstrict-prototypes -Wunused -Wunused-parameter -Wunused-function -Wunused-value -Wmissing-prototypes -Wmissing-declarations -Wdeclaration-after-statement -Wold-style-definition -fno-builtin-strlen -finline-limit=0 -fomit-frame-pointer -ffunction-sections -fdata-sections -fno-guess-branch-probability -funsigned-char -static-libgcc -falign-functions=1 -falign-jumps=1 -falign-labels=1 -falign-loops=1 -Os     -D"KBUILD_STR(s)=#s" -D"KBUILD_BASENAME=KBUILD_STR(vdprintf)"  -D"KBUILD_MODNAME=KBUILD_STR(vdprintf)" -c -o libbb/vdprintf.o libbb/vdprintf.c
*  gcc -Wp,-MD,libbb/.verror_msg.o.d   -std=gnu99 -Iinclude -Ilibbb  -include include/autoconf.h -D_GNU_SOURCE -DNDEBUG -D_LARGEFILE_SOURCE -D_LARGEFILE64_SOURCE -D_FILE_OFFSET_BITS=64 -D"BB_VER=KBUILD_STR(1.20.2)" -DBB_BT=AUTOCONF_TIMESTAMP  -Wall -Wshadow -Wwrite-strings -Wundef -Wstrict-prototypes -Wunused -Wunused-parameter -Wunused-function -Wunused-value -Wmissing-prototypes -Wmissing-declarations -Wdeclaration-after-statement -Wold-style-definition -fno-builtin-strlen -finline-limit=0 -fomit-frame-pointer -ffunction-sections -fdata-sections -fno-guess-branch-probability -funsigned-char -static-libgcc -falign-functions=1 -falign-jumps=1 -falign-labels=1 -falign-loops=1 -Os     -D"KBUILD_STR(s)=#s" -D"KBUILD_BASENAME=KBUILD_STR(verror_msg)"  -D"KBUILD_MODNAME=KBUILD_STR(verror_msg)" -c -o libbb/verror_msg.o libbb/verror_msg.c
*libbb/update_passwd.c: In function 'update_passwd':
*libbb/update_passwd.c:138:3: warning: ignoring return value of 'fchown', declared with attribute warn_unused_result [-Wunused-result]
*--
*  gcc -Wp,-MD,libbb/.xgetcwd.o.d   -std=gnu99 -Iinclude -Ilibbb  -include include/autoconf.h -D_GNU_SOURCE -DNDEBUG -D_LARGEFILE_SOURCE -D_LARGEFILE64_SOURCE -D_FILE_OFFSET_BITS=64 -D"BB_VER=KBUILD_STR(1.20.2)" -DBB_BT=AUTOCONF_TIMESTAMP  -Wall -Wshadow -Wwrite-strings -Wundef -Wstrict-prototypes -Wunused -Wunused-parameter -Wunused-function -Wunused-value -Wmissing-prototypes -Wmissing-declarations -Wdeclaration-after-statement -Wold-style-definition -fno-builtin-strlen -finline-limit=0 -fomit-frame-pointer -ffunction-sections -fdata-sections -fno-guess-branch-probability -funsigned-char -static-libgcc -falign-functions=1 -falign-jumps=1 -falign-labels=1 -falign-loops=1 -Os     -D"KBUILD_STR(s)=#s" -D"KBUILD_BASENAME=KBUILD_STR(xgetcwd)"  -D"KBUILD_MODNAME=KBUILD_STR(xgetcwd)" -c -o libbb/xgetcwd.o libbb/xgetcwd.c
*  gcc -Wp,-MD,libbb/.xgethostbyname.o.d   -std=gnu99 -Iinclude -Ilibbb  -include include/autoconf.h -D_GNU_SOURCE -DNDEBUG -D_LARGEFILE_SOURCE -D_LARGEFILE64_SOURCE -D_FILE_OFFSET_BITS=64 -D"BB_VER=KBUILD_STR(1.20.2)" -DBB_BT=AUTOCONF_TIMESTAMP  -Wall -Wshadow -Wwrite-strings -Wundef -Wstrict-prototypes -Wunused -Wunused-parameter -Wunused-function -Wunused-value -Wmissing-prototypes -Wmissing-declarations -Wdeclaration-after-statement -Wold-style-definition -fno-builtin-strlen -finline-limit=0 -fomit-frame-pointer -ffunction-sections -fdata-sections -fno-guess-branch-probability -funsigned-char -static-libgcc -falign-functions=1 -falign-jumps=1 -falign-labels=1 -falign-loops=1 -Os     -D"KBUILD_STR(s)=#s" -D"KBUILD_BASENAME=KBUILD_STR(xgethostbyname)"  -D"KBUILD_MODNAME=KBUILD_STR(xgethostbyname)" -c -o libbb/xgethostbyname.o libbb/xgethostbyname.c
*  gcc -Wp,-MD,libbb/.xreadlink.o.d   -std=gnu99 -Iinclude -Ilibbb  -include include/autoconf.h -D_GNU_SOURCE -DNDEBUG -D_LARGEFILE_SOURCE -D_LARGEFILE64_SOURCE -D_FILE_OFFSET_BITS=64 -D"BB_VER=KBUILD_STR(1.20.2)" -DBB_BT=AUTOCONF_TIMESTAMP  -Wall -Wshadow -Wwrite-strings -Wundef -Wstrict-prototypes -Wunused -Wunused-parameter -Wunused-function -Wunused-value -Wmissing-prototypes -Wmissing-declarations -Wdeclaration-after-statement -Wold-style-definition -fno-builtin-strlen -finline-limit=0 -fomit-frame-pointer -ffunction-sections -fdata-sections -fno-guess-branch-probability -funsigned-char -static-libgcc -falign-functions=1 -falign-jumps=1 -falign-labels=1 -falign-loops=1 -Os     -D"KBUILD_STR(s)=#s" -D"KBUILD_BASENAME=KBUILD_STR(xreadlink)"  -D"KBUILD_MODNAME=KBUILD_STR(xreadlink)" -c -o libbb/xreadlink.o libbb/xreadlink.c
*  gcc -Wp,-MD,libbb/.xrealloc_vector.o.d   -std=gnu99 -Iinclude -Ilibbb  -include include/autoconf.h -D_GNU_SOURCE -DNDEBUG -D_LARGEFILE_SOURCE -D_LARGEFILE64_SOURCE -D_FILE_OFFSET_BITS=64 -D"BB_VER=KBUILD_STR(1.20.2)" -DBB_BT=AUTOCONF_TIMESTAMP  -Wall -Wshadow -Wwrite-strings -Wundef -Wstrict-prototypes -Wunused -Wunused-parameter -Wunused-function -Wunused-value -Wmissing-prototypes -Wmissing-declarations -Wdeclaration-after-statement -Wold-style-definition -fno-builtin-strlen -finline-limit=0 -fomit-frame-pointer -ffunction-sections -fdata-sections -fno-guess-branch-probability -funsigned-char -static-libgcc -falign-functions=1 -falign-jumps=1 -falign-labels=1 -falign-loops=1 -Os     -D"KBUILD_STR(s)=#s" -D"KBUILD_BASENAME=KBUILD_STR(xrealloc_vector)"  -D"KBUILD_MODNAME=KBUILD_STR(xrealloc_vector)" -c -o libbb/xrealloc_vector.o libbb/xrealloc_vector.c
*libbb/xfuncs_printf.c: In function 'generate_uuid':
*libbb/xfuncs_printf.c:593:3: warning: ignoring return value of 'read', declared with attribute warn_unused_result [-Wunused-result]
*--
*make[1]: Leaving directory '/var/tmp/genkernel/20584.25697.22743.25540/LVM2.2.02.88/man'
*gcc -c -I. -I../include -DHAVE_CONFIG_H -DDM_IOCTLS -fPIC -fPIC -Wall -Wundef -Wshadow -Wcast-align -Wwrite-strings -Wmissing-prototypes -Wmissing-declarations -Wnested-externs -Winline -Wmissing-noreturn -Wformat-security -Wredundant-decls -Wpointer-arith -O2 device/dev-io.c -o device/dev-io.o
*gcc -c -I. -I../include -DHAVE_CONFIG_H -DDM_IOCTLS -fPIC -fPIC -Wall -Wundef -Wshadow -Wcast-align -Wwrite-strings -Wmissing-prototypes -Wmissing-declarations -Wnested-externs -Winline -Wmissing-noreturn -Wformat-security -Wredundant-decls -Wpointer-arith -O2 device/dev-md.c -o device/dev-md.o
*gcc -c -I. -I../include -DHAVE_CONFIG_H -DDM_IOCTLS -fPIC -fPIC -Wall -Wundef -Wshadow -Wcast-align -Wwrite-strings -Wmissing-prototypes -Wmissing-declarations -Wnested-externs -Winline -Wmissing-noreturn -Wformat-security -Wredundant-decls -Wpointer-arith -O2 device/dev-swap.c -o device/dev-swap.o
*device/dev-md.c: In function 'dev_is_md':
*device/dev-md.c:76:12: warning: 'sb_offset' may be used uninitialized in this function [-Wmaybe-uninitialized]
*--
*                             ^
*../include/util.h:29:30: note: in definition of macro 'uninitialized_var'
* #define uninitialized_var(x) x
*                              ^
*commands/toolcontext.c: In function '_init_dev_cache':
*commands/toolcontext.c:666:16: warning: 'udev_dir' may be used uninitialized in this function [-Wmaybe-uninitialized]
*        udev_dir[len] != cv->v.str[len]) {
*                ^
*commands/toolcontext.c:664:8: warning: 'udev_dir_len' may be used uninitialized in this function [-Wmaybe-uninitialized]
*--
*gcc -c -I. -I../include -DHAVE_CONFIG_H -DDM_IOCTLS -fPIC -fPIC -Wall -Wundef -Wshadow -Wcast-align -Wwrite-strings -Wmissing-prototypes -Wmissing-declarations -Wnested-externs -Winline -Wmissing-noreturn -Wformat-security -Wredundant-decls -Wpointer-arith -O2 format_pool/import_export.c -o format_pool/import_export.o
*gcc -c -I. -I../include -DHAVE_CONFIG_H -DDM_IOCTLS -fPIC -fPIC -Wall -Wundef -Wshadow -Wcast-align -Wwrite-strings -Wmissing-prototypes -Wmissing-declarations -Wnested-externs -Winline -Wmissing-noreturn -Wformat-security -Wredundant-decls -Wpointer-arith -O2 format_pool/pool_label.c -o format_pool/pool_label.o
*gcc -c -I. -I../include -DHAVE_CONFIG_H -DDM_IOCTLS -fPIC -fPIC -Wall -Wundef -Wshadow -Wcast-align -Wwrite-strings -Wmissing-prototypes -Wmissing-declarations -Wnested-externs -Winline -Wmissing-noreturn -Wformat-security -Wredundant-decls -Wpointer-arith -O2 snapshot/snapshot.c -o snapshot/snapshot.o
*gcc -c -I. -I../include -DHAVE_CONFIG_H -DDM_IOCTLS -fPIC -fPIC -Wall -Wundef -Wshadow -Wcast-align -Wwrite-strings -Wmissing-prototypes -Wmissing-declarations -Wnested-externs -Winline -Wmissing-noreturn -Wformat-security -Wredundant-decls -Wpointer-arith -O2 mirror/mirrored.c -o mirror/mirrored.o
*metadata/metadata.c: In function '_get_pvs':
*metadata/metadata.c:3674:12: warning: 'results' may be used uninitialized in this function [-Wmaybe-uninitialized]
*--
*gcc -c -I. -I../include -DLVM_SHARED_PATH=\"//sbin/lvm\" -DHAVE_CONFIG_H -DDM_IOCTLS -fPIC -fPIC -Wall -Wundef -Wshadow -Wcast-align -Wwrite-strings -Wmissing-prototypes -Wmissing-declarations -Wnested-externs -Winline -Wmissing-noreturn -Wformat-security -Wredundant-decls -Wpointer-arith -O2 polldaemon.c -o polldaemon.o
*gcc -c -I. -I../include -DLVM_SHARED_PATH=\"//sbin/lvm\" -DHAVE_CONFIG_H -DDM_IOCTLS -fPIC -fPIC -Wall -Wundef -Wshadow -Wcast-align -Wwrite-strings -Wmissing-prototypes -Wmissing-declarations -Wnested-externs -Winline -Wmissing-noreturn -Wformat-security -Wredundant-decls -Wpointer-arith -O2 pvchange.c -o pvchange.o
*gcc -c -I. -I../include -DLVM_SHARED_PATH=\"//sbin/lvm\" -DHAVE_CONFIG_H -DDM_IOCTLS -fPIC -fPIC -Wall -Wundef -Wshadow -Wcast-align -Wwrite-strings -Wmissing-prototypes -Wmissing-declarations -Wnested-externs -Winline -Wmissing-noreturn -Wformat-security -Wredundant-decls -Wpointer-arith -O2 pvck.c -o pvck.o
*gcc -c -I. -I../include -DLVM_SHARED_PATH=\"//sbin/lvm\" -DHAVE_CONFIG_H -DDM_IOCTLS -fPIC -fPIC -Wall -Wundef -Wshadow -Wcast-align -Wwrite-strings -Wmissing-prototypes -Wmissing-declarations -Wnested-externs -Winline -Wmissing-noreturn -Wformat-security -Wredundant-decls -Wpointer-arith -O2 pvcreate.c -o pvcreate.o
*lvconvert.c: In function '_lvconvert_single':
*lvconvert.c:1450:10: warning: 'image_count' may be used uninitialized in this function [-Wmaybe-uninitialized]
*--
*	-llvm-internal  -ldl -ldevmapper    -rdynamic
*gcc -fPIC -fPIC -Wall -Wundef -Wshadow -Wcast-align -Wwrite-strings -Wmissing-prototypes -Wmissing-declarations -Wnested-externs -Winline -Wmissing-noreturn -Wformat-security -Wredundant-decls -Wpointer-arith -O2 -Wl,--export-dynamic -L../libdm -L../lib -Wl,--no-export-dynamic -static -L../libdm/ioctl -o lvm.static \
*      dumpconfig.o formats.o lvchange.o lvconvert.o lvcreate.o lvdisplay.o lvextend.o lvmchange.o lvmcmdline.o lvmdiskscan.o lvreduce.o lvremove.o lvrename.o lvresize.o lvscan.o polldaemon.o pvchange.o pvck.o pvcreate.o pvdisplay.o pvmove.o pvremove.o pvresize.o pvscan.o reporter.o segtypes.o toollib.o vgcfgbackup.o vgcfgrestore.o vgchange.o vgck.o vgcreate.o vgconvert.o vgdisplay.o vgexport.o vgextend.o vgimport.o vgmerge.o vgmknodes.o vgreduce.o vgremove.o vgrename.o vgscan.o vgsplit.o lvm-static.o -llvm-internal  -ldl -ldevmapper    
*ar rs liblvm2cmd.a dumpconfig.o formats.o lvchange.o lvconvert.o lvcreate.o lvdisplay.o lvextend.o lvmchange.o lvmcmdline.o lvmdiskscan.o lvreduce.o lvremove.o lvrename.o lvresize.o lvscan.o polldaemon.o pvchange.o pvck.o pvcreate.o pvdisplay.o pvmove.o pvremove.o pvresize.o pvscan.o reporter.o segtypes.o toollib.o vgcfgbackup.o vgcfgrestore.o vgchange.o vgck.o vgcreate.o vgconvert.o vgdisplay.o vgexport.o vgextend.o vgimport.o vgmerge.o vgmknodes.o vgreduce.o vgremove.o vgrename.o vgscan.o vgsplit.o lvmcmdlib.o lvm2cmd.o
*../lib/liblvm-internal.a(sharedlib.o): In function `load_shared_library':
*sharedlib.c:(.text+0x153): warning: Using 'dlopen' in statically linked applications requires at runtime the shared libraries from the glibc version used for linking
*--
*checking getopt.h presence... yes
*checking for getopt.h... yes
*checking for dlopen in -ldl... yes
*checking for pthread_mutex_lock in -lpthread... yes
*checking for dm_event_handler_create in -ldevmapper-event... no
*configure: error: device-mapper-event library is either missing or is too old and badly linked
*--
* Running with options: --callback=emerge -qN app-accessibility/espeakup media-libs/alsa-oss media-sound/alsa-utils net-dialup/globespan-adsl sys-apps/pcmciautils sys-kernel/linux-firmware --lvm --dmraid --mdadm --makeopts=-j8 --cachedir=/tmp/kerncache/gentoo-genkernel_cache-20151029 --no-mountboot --kerneldir=/usr/src/linux --modulespackage=/tmp/kerncache/gentoo-modules-20151029.tar.bz2 --minkernpackage=/tmp/kerncache/gentoo-kernel-initrd-20151029.tar.bz2 all --kernel-config=/var/tmp/gentoo.config
* Using genkernel.conf from /etc/genkernel.conf
* Sourcing arch-specific config.sh from /usr/share/genkernel/arch/x86_64/config.sh ..
* Sourcing arch-specific modules_load from /usr/share/genkernel/arch/x86_64/modules_load ..
*
* ERROR: Configure of dmraid failed!
* 
* -- End log... --
* 
* Please consult /var/log/genkernel.log for more information and any
* errors that were reported above.
* 
* Report any genkernel bugs to bugs.gentoo.org and
* assign your bug to genkernel@g.o. Please include
* as much information as you can in your bug report; attaching
* /var/log/genkernel.log so that your issue can be dealt with effectively.
* 
* Please do *not* report compilation failures as genkernel bugs!
* 

!!! catalyst: Runscript kernel build failed


Traceback (most recent call last):
  File "modules/generic_stage_target.py", line 1428, in build_kernel
    self._build_kernel(kname=kname)
  File "modules/generic_stage_target.py", line 1472, in _build_kernel
    "Runscript kernel build failed",env=self.env)
  File "/usr/lib64/catalyst//modules/catalyst_support.py", line 541, in cmd
    raise CatalystError,myexc
CatalystError
None

!!! catalyst: build aborting due to kernel build error.

Traceback (most recent call last):
File "/usr/lib64/catalyst/catalyst", line 218, in build_target
    mytarget.run()
File "modules/generic_stage_target.py", line 1304, in run
    apply(getattr(self,x))
File "modules/generic_stage_target.py", line 1433, in build_kernel
    "build aborting due to kernel build error."
CatalystError
!!! catalyst: Error encountered during run of target livecd-stage2
Catalyst aborting....
lockfile does not exist '/release/buildroot/amd64-dev/tmp/default/livecd-stage2-amd64-20151029/.catalyst_lock'



Full build log at /release/tmp/run/catalyst-auto.KFg9uO/log/installcd-stage2-minimal.log