Gentoo Archives: gentoo-science

From: Vadim <vadim@××××××××××.ru>
To: gentoo-science@l.g.o
Subject: [gentoo-science] scipy build failure
Date: Sun, 03 Sep 2006 20:48:06
Message-Id: 44FB3AA3.8030105@vkonovalov.ru
Dear maintainers,

I get build failure when doing
 USE="umfpack fftw" emerge -v scipy

I will appreciate any advice on the matter.

i686-pc-linux-gnu-gcc: Lib/io/numpyiomodule.c
Lib/io/numpyiomodule.c: In function 'PyTypeFromChar':
Lib/io/numpyiomodule.c:698: error: 'PyArray_SBYTE' undeclared (first use
in this function)
Lib/io/numpyiomodule.c:698: error: (Each undeclared identifier is
reported only once
Lib/io/numpyiomodule.c:698: error: for each function it appears in.)
Lib/io/numpyiomodule.c: In function 'PyTypeFromChar':
Lib/io/numpyiomodule.c:698: error: 'PyArray_SBYTE' undeclared (first use
in this function)
Lib/io/numpyiomodule.c:698: error: (Each undeclared identifier is
reported only once
Lib/io/numpyiomodule.c:698: error: for each function it appears in.)
error: Command "i686-pc-linux-gnu-gcc -pthread -fno-strict-aliasing
-DNDEBUG -O3 -march=i686 -pipe -fomit-frame-pointer
-mpreferred-stack-boundary=2 -falign-functions=0 -falign-jumps=0
-falign-loops=0 -fPIC
-I/usr/lib/python2.4/site-packages/numpy/core/include
-I/usr/include/python2.4 -c Lib/io/numpyiomodule.c -o
build/temp.linux-i686-2.4/Lib/io/numpyiomodule.o" failed with exit status 1

!!! ERROR: sci-libs/scipy-0.4.9 failed.
Call stack:
  ebuild.sh, line 1543:   Called dyn_compile
  ebuild.sh, line 938:   Called src_compile
  ebuild.sh, line 1252:   Called distutils_src_compile
  distutils.eclass, line 38:   Called die

!!! compilation failed
!!! If you need support, post the topmost build error, and the call
stack if relevant.

!!! This ebuild is from an overlay: '/usr/local/sci'


Best regards,
Vadim.

-- 
gentoo-science@g.o mailing list

Replies

Subject Author
Re: [gentoo-science] scipy build failure David Grant <davidgrant@×××××.com>