Gentoo Archives: gentoo-user

From: Klaus Ethgen <Klaus+gentoo@××××××.de>
To: gentoo-user@l.g.o
Subject: [gentoo-user] dev-libs/ucommon
Date: Sun, 26 Aug 2018 09:33:37
2 Hash: SHA512
4 Hi folks,
6 I need dev-libs/ucommon but failed to compile:
7 > emerge --info '=dev-libs/ucommon-6.0.3'
8 Portage 2.3.40 (python 3.6.5-final-0, default/linux/amd64/17.0/hardened, gcc-7.3.0, glibc-2.26-r7, 4.18.5-gentoo x86_64)
9 =================================================================
10 System Settings
11 =================================================================
12 System uname: Linux-4.18.5-gentoo-x86_64-Intel-R-_Core-TM-2_Duo_CPU_L7500_@_1.60GHz-with-gentoo-2.4.1
13 KiB Mem: 3969708 total, 1132364 free
14 KiB Swap: 2096476 total, 2096476 free
15 Timestamp of repository gentoo: Sun, 26 Aug 2018 08:30:01 +0000
16 Head commit of repository gentoo: 7b250144b71909f550bec1c8a1f9415c89da37cd
17 Timestamp of repository quarks: Sat, 25 Aug 2018 19:45:05 +0000
18 Head commit of repository quarks: 760d3ded9f126ddf0d710bb72c4e0d4e58cc5fa2
20 sh bash 4.4_p12
21 ld GNU ld (Gentoo 2.30 p2) 2.30.0
22 ccache version 3.3.4 [enabled]
23 app-shells/bash: 4.4_p12::gentoo
24 dev-java/java-config: 2.2.0-r4::gentoo
25 dev-lang/perl: 5.24.3-r1::gentoo
26 dev-lang/python: 2.7.14-r1::gentoo, 3.6.5::gentoo
27 dev-util/ccache: 3.3.4-r1::gentoo
28 dev-util/cmake: 3.9.6::gentoo
29 dev-util/pkgconfig: 0.29.2::gentoo
30 sys-apps/baselayout: 2.4.1-r2::gentoo
31 sys-apps/openrc: 0.34.11::gentoo
32 sys-apps/sandbox: 2.13::gentoo
33 sys-devel/autoconf: 2.13::gentoo, 2.69-r4::gentoo
34 sys-devel/automake: 1.11.6-r3::gentoo, 1.15.1-r2::gentoo
35 sys-devel/binutils: 2.30-r2::gentoo
36 sys-devel/gcc: 7.3.0-r3::gentoo
37 sys-devel/gcc-config: 1.8-r1::gentoo
38 sys-devel/libtool: 2.4.6-r3::gentoo
39 sys-devel/make: 4.2.1-r3::gentoo
40 sys-kernel/linux-headers: 4.16-r1::gentoo (virtual/os-headers)
41 sys-libs/glibc: 2.26-r7::gentoo
42 Repositories:
44 gentoo
45 location: /usr/portage
46 sync-type: rsync
47 sync-uri: rsync://
48 priority: -1000
49 sync-rsync-verify-max-age: 24
50 sync-rsync-verify-jobs: 1
51 sync-rsync-verify-metamanifest: no
52 sync-rsync-extra-opts:
54 quarks
55 location: /var/db/repos/quarks
56 sync-type: git
57 sync-uri:
58 masters: gentoo
60 flightsim
61 location: /var/lib/layman/flightsim
62 masters: gentoo
63 priority: 50
67 CBUILD="x86_64-pc-linux-gnu"
68 CFLAGS="-march=native -O2 -pipe"
69 CHOST="x86_64-pc-linux-gnu"
70 CONFIG_PROTECT="/etc /usr/share/gnupg/qualified.txt"
71 CONFIG_PROTECT_MASK="/etc/ca-certificates.conf /etc/env.d /etc/fonts/fonts.conf /etc/gconf /etc/gentoo-release /etc/revdep-rebuild /etc/sandbox.d /etc/terminfo /etc/texmf/language.dat.d /etc/texmf/language.def.d /etc/texmf/updmap.d /etc/texmf/web2c"
72 CXXFLAGS="-march=native -O2 -pipe"
73 DISTDIR="/usr/portage/distfiles"
75 FCFLAGS="-O2 -pipe"
76 FEATURES="assume-digests binpkg-logs ccache config-protect-if-modified distlocks ebuild-locks fixlafiles merge-sync multilib-strict news parallel-fetch preserve-libs protect-owned sandbox sfperms strict unknown-features-warn unmerge-logs unmerge-orphans userfetch userpriv usersandbox usersync xattr"
77 FFLAGS="-O2 -pipe"
79 LANG="de_DE"
80 LC_ALL="C"
81 LDFLAGS="-Wl,-O1 -Wl,--as-needed"
82 MAKEOPTS="-j3"
83 PKGDIR="/usr/portage/packages"
85 PORTAGE_RSYNC_OPTS="--recursive --links --safe-links --perms --times --omit-dir-times --compress --force --whole-file --delete --stats --human-readable --timeout=180 --exclude=/distfiles --exclude=/local --exclude=/packages --exclude=/.git"
86 PORTAGE_TMPDIR="/var/tmp"
87 USE="X acl alsa amd64 bzip2 caps crypt cxx hardened iconv ipv6 jpeg libtirpc multilib ncurses nls nptl openmp oss pam pcre pcsc-lite pie png pulseaudio readline seccomp ssl ssp threads udev unicode xattr xtpax zlib zsh-completion" ABI_X86="64" ALSA_CARDS="ali5451 als4000 atiixp atiixp-modem bt87x ca0106 cmipci emu10k1x ens1370 ens1371 es1938 es1968 fm801 hda-intel intel8x0 intel8x0m maestro3 trident usb-audio via82xx via82xx-modem ymfpci" APACHE2_MODULES="authn_core authz_core socache_shmcb unixd actions alias auth_basic authn_alias authn_anon authn_dbm authn_default authn_file authz_dbm authz_default authz_groupfile authz_host authz_owner authz_user autoindex cache cgi cgid dav dav_fs dav_lock deflate dir disk_cache env expires ext_filter file_cache filter headers include info log_config logio mem_cache mime mime_magic negotiation rewrite setenvif speling status unique_id userdir usertrack vhost_alias" CALLIGRA_FEATURES="karbon plan sheets stage words" COLLECTD_PLUGINS="df interface irq load memory rrdtool swap syslog" CPU_FLAGS_X86="mmx mmxext sse sse2" ELIBC="glibc" GPSD_PROTOCOLS="ashtech aivdm earthmate evermore fv18 garmin garmintxt gpsclock isync itrax mtk3301 nmea ntrip navcom oceanserver oldstyle oncore rtcm104v2 rtcm104v3 sirf skytraq superstar2 timing tsip tripmate tnt ublox ubx" GRUB_PLATFORMS="pc" INPUT_DEVICES="evdev keyboard mouse wacom" KERNEL="linux" L10N="de de-1901 de-DE" LCD_DEVICES="bayrad cfontz cfontz633 glk hd44780 lb216 lcdm001 mtxorb ncurses text" LIBREOFFICE_EXTENSIONS="presenter-console presenter-minimizer" OFFICE_IMPLEMENTATION="libreoffice" PHP_TARGETS="php5-6 php7-0" POSTGRES_TARGETS="postgres9_5 postgres10" PYTHON_SINGLE_TARGET="python3_6" PYTHON_TARGETS="python2_7 python3_6" RUBY_TARGETS="ruby23" USERLAND="GNU" VIDEO_CARDS="dummy fbdev radeon vesa" XTABLES_ADDONS="quota2 psd pknock lscan length2 ipv4options ipset ipp2p iface geoip fuzzy condition tee tarpit sysrq steal rawnat logmark ipmark dhcpmac delude chaos account"
90 > emerge -pqv =dev-libs/ucommon-6.0.3
91 [ebuild N ] dev-libs/ucommon-6.0.3 USE="cxx ssl -debug -doc -gnutls -socks -static-libs"
93 /var/tmp/portage/dev-libs/ucommon-6.0.3/temp/build.log:
94 [32m * [39;49;00mPackage: dev-libs/ucommon-6.0.3
95 [32m * [39;49;00mRepository: gentoo
96 [32m * [39;49;00mMaintainer: maksbotan@g.o
97 [32m * [39;49;00mUSE: abi_x86_64 amd64 cxx elibc_glibc kernel_linux ssl userland_GNU
98 [32m * [39;49;00mFEATURES: ccache preserve-libs sandbox userpriv usersandbox
99 >>> Unpacking source...
100 >>> Unpacking ucommon-6.0.3.tar.gz to /var/tmp/portage/dev-libs/ucommon-6.0.3/work
101 >>> Source unpacked in /var/tmp/portage/dev-libs/ucommon-6.0.3/work
102 >>> Preparing source in /var/tmp/portage/dev-libs/ucommon-6.0.3/work/ucommon-6.0.3 ...
103 [32m*[0m Applying ucommon-6.0.3-disable_rtf_gen_doxy.patch ...
104 [A[161C [34m[ [32mok[34m ][0m
105 [32m*[0m Applying ucommon-6.0.3-install_gcrypt.m4_file.patch ...
106 [A[161C [34m[ [32mok[34m ][0m
107 [32m*[0m Applying ucommon-6.0.3-gcrypt_autotools.patch ...
108 [A[161C [34m[ [32mok[34m ][0m
109 [32m*[0m Running eautoreconf in '/var/tmp/portage/dev-libs/ucommon-6.0.3/work/ucommon-6.0.3' ...
110 [32m*[0m Running libtoolize --install --copy --force --automake ...
111 [A[161C [34m[ [32mok[34m ][0m
112 [32m*[0m Running aclocal -I m4 ...
113 [A[161C [34m[ [32mok[34m ][0m
114 [32m*[0m Running autoconf --force ...
115 [A[161C [34m[ [32mok[34m ][0m
116 [32m*[0m Running autoheader ...
117 [A[161C [34m[ [32mok[34m ][0m
118 [32m*[0m Running automake --add-missing --copy --force-missing ...
119 [A[161C [34m[ [32mok[34m ][0m
120 * Running elibtoolize in: ucommon-6.0.3/
121 * Running elibtoolize in: ucommon-6.0.3/autoconf/
122 * Applying portage/1.2.0 patch ...
123 * Applying sed/1.5.6 patch ...
124 * Applying as-needed/2.4.3 patch ...
125 >>> Source prepared.
126 >>> Configuring source in /var/tmp/portage/dev-libs/ucommon-6.0.3/work/ucommon-6.0.3 ...
127 >>> Working in BUILD_DIR: "/var/tmp/portage/dev-libs/ucommon-6.0.3/work/ucommon-6.0.3"
128 * econf: updating ucommon-6.0.3/autoconf/config.guess with /usr/share/gnuconfig/config.guess
129 * econf: updating ucommon-6.0.3/autoconf/config.sub with /usr/share/gnuconfig/config.sub
130 /var/tmp/portage/dev-libs/ucommon-6.0.3/work/ucommon-6.0.3/configure --prefix=/usr --build=x86_64-pc-linux-gnu --host=x86_64-pc-linux-gnu --mandir=/usr/share/man --infodir=/usr/share/info --datadir=/usr/share --sysconfdir=/etc --localstatedir=/var/lib --disable-dependency-tracking --disable-silent-rules --libdir=/usr/lib64 --docdir=/usr/share/doc/ucommon-6.0.3 --enable-shared --disable-static --disable-socks --enable-stdcpp --with-sslstack=ssl --enable-atomics --with-pkg-config
131 checking build system type... x86_64-pc-linux-gnu
132 checking host system type... x86_64-pc-linux-gnu
133 checking target system type... x86_64-pc-linux-gnu
134 checking for x86_64-pc-linux-gnu-gcc... x86_64-pc-linux-gnu-gcc
135 checking whether the C compiler works... yes
136 checking for C compiler default output file name... a.out
137 checking for suffix of executables...
138 checking whether we are cross compiling... no
139 checking for suffix of object files... o
140 checking whether we are using the GNU C compiler... yes
141 checking whether x86_64-pc-linux-gnu-gcc accepts -g... yes
142 checking for x86_64-pc-linux-gnu-gcc option to accept ISO C89... none needed
143 checking whether x86_64-pc-linux-gnu-gcc understands -c and -o together... yes
144 checking how to run the C preprocessor... x86_64-pc-linux-gnu-gcc -E
145 checking for x86_64-pc-linux-gnu-gcc... (cached) x86_64-pc-linux-gnu-gcc
146 checking whether we are using the GNU C compiler... (cached) yes
147 checking whether x86_64-pc-linux-gnu-gcc accepts -g... (cached) yes
148 checking for x86_64-pc-linux-gnu-gcc option to accept ISO C89... (cached) none needed
149 checking whether x86_64-pc-linux-gnu-gcc understands -c and -o together... (cached) yes
150 checking for x86_64-pc-linux-gnu-g++... x86_64-pc-linux-gnu-g++
151 checking whether we are using the GNU C++ compiler... yes
152 checking whether x86_64-pc-linux-gnu-g++ accepts -g... yes
153 checking how to run the C++ preprocessor... x86_64-pc-linux-gnu-g++ -E
154 checking whether we are using the GNU C++ compiler... (cached) yes
155 checking whether x86_64-pc-linux-gnu-g++ accepts -g... (cached) yes
156 checking how to print strings... printf
157 checking for a sed that does not truncate output... /bin/sed
158 checking for grep that handles long lines and -e... /bin/grep
159 checking for egrep... /bin/grep -E
160 checking for fgrep... /bin/grep -F
161 checking for ld used by x86_64-pc-linux-gnu-gcc... /usr/x86_64-pc-linux-gnu/bin/ld
162 checking if the linker (/usr/x86_64-pc-linux-gnu/bin/ld) is GNU ld... yes
163 checking for BSD- or MS-compatible name lister (nm)... /usr/bin/x86_64-pc-linux-gnu-nm -B
164 checking the name lister (/usr/bin/x86_64-pc-linux-gnu-nm -B) interface... BSD nm
165 checking whether ln -s works... yes
166 checking the maximum length of command line arguments... 1572864
167 checking how to convert x86_64-pc-linux-gnu file names to x86_64-pc-linux-gnu format... func_convert_file_noop
168 checking how to convert x86_64-pc-linux-gnu file names to toolchain format... func_convert_file_noop
169 checking for /usr/x86_64-pc-linux-gnu/bin/ld option to reload object files... -r
170 checking for x86_64-pc-linux-gnu-objdump... objdump
171 checking how to recognize dependent libraries... pass_all
172 checking for x86_64-pc-linux-gnu-dlltool... dlltool
173 checking how to associate runtime and link libraries... printf %s\n
174 checking for x86_64-pc-linux-gnu-ar... x86_64-pc-linux-gnu-ar
175 checking for archiver @FILE support... @
176 checking for x86_64-pc-linux-gnu-strip... x86_64-pc-linux-gnu-strip
177 checking for x86_64-pc-linux-gnu-ranlib... x86_64-pc-linux-gnu-ranlib
178 checking for gawk... gawk
179 checking command to parse /usr/bin/x86_64-pc-linux-gnu-nm -B output from x86_64-pc-linux-gnu-gcc object... ok
180 checking for sysroot... no
181 checking for a working dd... /bin/dd
182 checking how to truncate binary pipes... /bin/dd bs=4096 count=1
183 checking for x86_64-pc-linux-gnu-mt... no
184 checking for mt... no
185 checking if : is a manifest tool... no
186 checking for ANSI C header files... yes
187 checking for sys/types.h... yes
188 checking for sys/stat.h... yes
189 checking for stdlib.h... yes
190 checking for string.h... yes
191 checking for memory.h... yes
192 checking for strings.h... yes
193 checking for inttypes.h... yes
194 checking for stdint.h... yes
195 checking for unistd.h... yes
196 checking for dlfcn.h... yes
197 checking for objdir... .libs
198 checking if x86_64-pc-linux-gnu-gcc supports -fno-rtti -fno-exceptions... no
199 checking for x86_64-pc-linux-gnu-gcc option to produce PIC... -fPIC -DPIC
200 checking if x86_64-pc-linux-gnu-gcc PIC flag -fPIC -DPIC works... yes
201 checking if x86_64-pc-linux-gnu-gcc static flag -static works... yes
202 checking if x86_64-pc-linux-gnu-gcc supports -c -o file.o... yes
203 checking if x86_64-pc-linux-gnu-gcc supports -c -o file.o... (cached) yes
204 checking whether the x86_64-pc-linux-gnu-gcc linker (/usr/x86_64-pc-linux-gnu/bin/ld -m elf_x86_64) supports shared libraries... yes
205 checking whether -lc should be explicitly linked in... no
206 checking dynamic linker characteristics... GNU/Linux
207 checking how to hardcode library paths into programs... immediate
208 checking whether stripping libraries is possible... yes
209 checking if libtool supports shared libraries... yes
210 checking whether to build shared libraries... yes
211 checking whether to build static libraries... no
212 checking how to run the C++ preprocessor... x86_64-pc-linux-gnu-g++ -E
213 checking for ld used by x86_64-pc-linux-gnu-g++... /usr/x86_64-pc-linux-gnu/bin/ld -m elf_x86_64
214 checking if the linker (/usr/x86_64-pc-linux-gnu/bin/ld -m elf_x86_64) is GNU ld... yes
215 checking whether the x86_64-pc-linux-gnu-g++ linker (/usr/x86_64-pc-linux-gnu/bin/ld -m elf_x86_64) supports shared libraries... yes
216 checking for x86_64-pc-linux-gnu-g++ option to produce PIC... -fPIC -DPIC
217 checking if x86_64-pc-linux-gnu-g++ PIC flag -fPIC -DPIC works... yes
218 checking if x86_64-pc-linux-gnu-g++ static flag -static works... yes
219 checking if x86_64-pc-linux-gnu-g++ supports -c -o file.o... yes
220 checking if x86_64-pc-linux-gnu-g++ supports -c -o file.o... (cached) yes
221 checking whether the x86_64-pc-linux-gnu-g++ linker (/usr/x86_64-pc-linux-gnu/bin/ld -m elf_x86_64) supports shared libraries... yes
222 checking dynamic linker characteristics... (cached) GNU/Linux
223 checking how to hardcode library paths into programs... immediate
224 checking for a BSD-compatible install... /usr/lib/portage/python3.6/ebuild-helpers/xattr/install -c
225 checking whether build environment is sane... yes
226 checking for a thread-safe mkdir -p... /bin/mkdir -p
227 checking whether make sets $(MAKE)... yes
228 checking for style of include used by make... GNU
229 checking whether make supports nested variables... yes
230 checking dependency style of x86_64-pc-linux-gnu-gcc... none
231 checking dependency style of x86_64-pc-linux-gnu-g++... none
232 checking for C/C++ restrict keyword... __restrict
233 checking for working volatile... yes
234 checking for inline... inline
235 checking whether make supports nested variables... (cached) yes
236 checking full c++ support and linking model... yes
237 checking for stdint.h... (cached) yes
238 checking poll.h usability... yes
239 checking poll.h presence... yes
240 checking for poll.h... yes
241 checking sys/mman.h usability... yes
242 checking sys/mman.h presence... yes
243 checking for sys/mman.h... yes
244 checking sys/shm.h usability... yes
245 checking sys/shm.h presence... yes
246 checking for sys/shm.h... yes
247 checking sys/poll.h usability... yes
248 checking sys/poll.h presence... yes
249 checking for sys/poll.h... yes
250 checking sys/timeb.h usability... yes
251 checking sys/timeb.h presence... yes
252 checking for sys/timeb.h... yes
253 checking endian.h usability... yes
254 checking endian.h presence... yes
255 checking for endian.h... yes
256 checking sys/filio.h usability... no
257 checking sys/filio.h presence... no
258 checking for sys/filio.h... no
259 checking dirent.h usability... yes
260 checking dirent.h presence... yes
261 checking for dirent.h... yes
262 checking sys/resource.h usability... yes
263 checking sys/resource.h presence... yes
264 checking for sys/resource.h... yes
265 checking wchar.h usability... yes
266 checking wchar.h presence... yes
267 checking for wchar.h... yes
268 checking netinet/in.h usability... yes
269 checking netinet/in.h presence... yes
270 checking for netinet/in.h... yes
271 checking net/if.h usability... yes
272 checking net/if.h presence... yes
273 checking for net/if.h... yes
274 checking mach/clock.h usability... no
275 checking mach/clock.h presence... no
276 checking for mach/clock.h... no
277 checking mach-o/dyld.h usability... no
278 checking mach-o/dyld.h presence... no
279 checking for mach-o/dyld.h... no
280 checking linux/version.h usability... yes
281 checking linux/version.h presence... yes
282 checking for linux/version.h... yes
283 checking sys/inotify.h usability... yes
284 checking sys/inotify.h presence... yes
285 checking for sys/inotify.h... yes
286 checking sys/event.h usability... no
287 checking sys/event.h presence... no
288 checking for sys/event.h... no
289 checking syslog.h usability... yes
290 checking syslog.h presence... yes
291 checking for syslog.h... yes
292 checking sys/wait.h usability... yes
293 checking sys/wait.h presence... yes
294 checking for sys/wait.h... yes
295 checking termios.h usability... yes
296 checking termios.h presence... yes
297 checking for termios.h... yes
298 checking termio.h usability... yes
299 checking termio.h presence... yes
300 checking for termio.h... yes
301 checking fcntl.h usability... yes
302 checking fcntl.h presence... yes
303 checking for fcntl.h... yes
304 checking for unistd.h... (cached) yes
305 checking sys/param.h usability... yes
306 checking sys/param.h presence... yes
307 checking for sys/param.h... yes
308 checking sys/lockf.h usability... no
309 checking sys/lockf.h presence... no
310 checking for sys/lockf.h... no
311 checking sys/file.h usability... yes
312 checking sys/file.h presence... yes
313 checking for sys/file.h... yes
314 checking for dlfcn.h... (cached) yes
315 checking regex.h usability... yes
316 checking regex.h presence... yes
317 checking for regex.h... yes
318 checking for regfree in -lregex... no
319 checking for fopen in -lmsvcrt... no
320 checking for __modsi3 in -lgcc... no
321 checking for socketpair in -lc... yes
322 checking for getaddrinfo in -lc... yes
323 checking for gethostbyname2 in -lc... yes
324 checking for inet_ntop in -lc... yes
325 checking for socket in -lsocket... no
326 checking for socks proxy support... no
327 checking for lstat in -lc... yes
328 checking for strcoll in -lc... yes
329 checking for stricmp in -lc... no
330 checking for stristr in -lc... no
331 checking for sysconf in -lc... yes
332 checking for posix_memalign in -lc... yes
333 checking for dlopen in -lc... no
334 checking for dlopen in -ldl... yes
335 checking pthread.h usability... yes
336 checking pthread.h presence... yes
337 checking for pthread.h... yes
338 checking for pthread_create in -lpthread... yes
339 checking for pthread_condattr_setclock in -lpthread... yes
340 checking for pthread_setconcurrency in -lpthread... yes
341 checking for pthread_yield in -lpthread... yes
342 checking for pthread_delay in -lpthread... no
343 checking for pthread_delay_np in -lpthread... no
344 checking for pthread_setschedprio in -lpthread... yes
345 checking for ftok... yes
346 checking for shm_open... no
347 checking for shm_open in -lposix4... no
348 checking for shm_open in -lrt... yes
349 checking for nanosleep... yes
350 checking for clock_nanosleep... yes
351 checking for clock_gettime... yes
352 checking for strerror_r... yes
353 checking for localtime_r... yes
354 checking for gmtime_r... yes
355 checking for posix_fadvise... yes
356 checking for ftruncate... yes
357 checking for pwrite... yes
358 checking for setpgrp... yes
359 checking for setlocale... yes
360 checking for gettext... yes
361 checking for execvp... yes
362 checking for atexit... yes
363 checking for realpath... yes
364 checking for symlink... yes
365 checking for readlink... yes
366 checking for waitpid... yes
367 checking for wait4... yes
368 checking stdexcept usability... yes
369 checking stdexcept presence... yes
370 checking for stdexcept... yes
371 checking for old style iostream... no
372 checking whether x86_64-pc-linux-gnu-g++ supports -mt... no
373 checking whether x86_64-pc-linux-gnu-g++ supports -pthread... yes
374 checking whether x86_64-pc-linux-gnu-g++ supports -fno-check-new... yes
375 checking whether x86_64-pc-linux-gnu-g++ supports -finline... yes
376 checking whether x86_64-pc-linux-gnu-g++ supports visibility... yes
377 checking for x86_64-pc-linux-gnu-pkg-config... /usr/bin/x86_64-pc-linux-gnu-pkg-config
378 checking pkg-config is at least version 0.9.0... yes
379 checking for openssl >= 0.9.7... yes
380 checking for gnutls >= 2.8.0... yes
381 checking secure library mode... openssl
382 checking libintl.h usability... yes
383 checking libintl.h presence... yes
384 checking for libintl.h... yes
385 checking for doxygen... doxygen
386 checking that generated files are newer than configure... done
387 configure: creating ./config.status
388 config.status: creating Makefile
389 config.status: creating corelib/Makefile
390 config.status: creating commoncpp/Makefile
391 config.status: creating openssl/Makefile
392 config.status: creating gnutls/Makefile
393 config.status: creating nossl/Makefile
394 config.status: creating utils/Makefile
395 config.status: creating inc/Makefile
396 config.status: creating inc/ucommon/Makefile
397 config.status: creating inc/commoncpp/Makefile
398 config.status: creating test/Makefile
399 config.status: creating directive
400 config.status: creating commoncpp.pc
401 config.status: creating ucommon.pc
402 config.status: creating ucommon.spec
403 config.status: creating ucommon-config
404 config.status: creating commoncpp-config
405 config.status: creating ucommon-config.h
406 config.status: executing libtool commands
407 config.status: executing depfiles commands
408 >>> Source configured.
409 >>> Compiling source in /var/tmp/portage/dev-libs/ucommon-6.0.3/work/ucommon-6.0.3 ...
410 >>> Working in BUILD_DIR: "/var/tmp/portage/dev-libs/ucommon-6.0.3/work/ucommon-6.0.3"
411 make -j3
412 make all-recursive
413 make[1]: Entering directory '/var/tmp/portage/dev-libs/ucommon-6.0.3/work/ucommon-6.0.3'
414 Making all in corelib
415 make[2]: Entering directory '/var/tmp/portage/dev-libs/ucommon-6.0.3/work/ucommon-6.0.3/corelib'
416 /bin/sh ../libtool --tag=CXX --mode=compile x86_64-pc-linux-gnu-g++ -DHAVE_CONFIG_H -I. -I.. -I../inc -Wno-long-long -DNEW_STDCPP -pthread -fno-check-new -finline -fvisibility=hidden -DUCOMMON_VISIBILITY=1 -march=native -O2 -pipe -c -o object.lo object.cpp
417 /bin/sh ../libtool --tag=CXX --mode=compile x86_64-pc-linux-gnu-g++ -DHAVE_CONFIG_H -I. -I.. -I../inc -Wno-long-long -DNEW_STDCPP -pthread -fno-check-new -finline -fvisibility=hidden -DUCOMMON_VISIBILITY=1 -march=native -O2 -pipe -c -o linked.lo linked.cpp
418 /bin/sh ../libtool --tag=CXX --mode=compile x86_64-pc-linux-gnu-g++ -DHAVE_CONFIG_H -I. -I.. -I../inc -Wno-long-long -DNEW_STDCPP -pthread -fno-check-new -finline -fvisibility=hidden -DUCOMMON_VISIBILITY=1 -march=native -O2 -pipe -c -o string.lo string.cpp
419 libtool: compile: x86_64-pc-linux-gnu-g++ -DHAVE_CONFIG_H -I. -I.. -I../inc -Wno-long-long -DNEW_STDCPP -pthread -fno-check-new -finline -fvisibility=hidden -DUCOMMON_VISIBILITY=1 -march=native -O2 -pipe -c object.cpp -fPIC -DPIC -o .libs/object.o
420 libtool: compile: x86_64-pc-linux-gnu-g++ -DHAVE_CONFIG_H -I. -I.. -I../inc -Wno-long-long -DNEW_STDCPP -pthread -fno-check-new -finline -fvisibility=hidden -DUCOMMON_VISIBILITY=1 -march=native -O2 -pipe -c linked.cpp -fPIC -DPIC -o .libs/linked.o
421 libtool: compile: x86_64-pc-linux-gnu-g++ -DHAVE_CONFIG_H -I. -I.. -I../inc -Wno-long-long -DNEW_STDCPP -pthread -fno-check-new -finline -fvisibility=hidden -DUCOMMON_VISIBILITY=1 -march=native -O2 -pipe -c string.cpp -fPIC -DPIC -o .libs/string.o
422 In file included from ../inc/ucommon/thread.h:69:0,
423 from linked.cpp:22:
424 ../inc/ucommon/memory.h: In member function 'unsigned int ucommon::assoc_pointer<T, I, M, P>::utilization() const':
425 ../inc/ucommon/memory.h:1240:39: error: no matching function for call to 'ucommon::assoc_pointer<T, I, M, P>::utilization() const'
426 {return mempager::utilization();}
427 ^
428 ../inc/ucommon/memory.h:216:14: note: candidate: unsigned int ucommon::mempager::utilization() <near match>
429 unsigned utilization(void);
430 ^~~~~~~~~~~
431 ../inc/ucommon/memory.h:216:14: note: passing 'const ucommon::assoc_pointer<T, I, M, P>*' as 'this' argument discards qualifiers
432 ../inc/ucommon/memory.h: In member function 'T* ucommon::keypager<T, M>::get(const char*) const':
433 ../inc/ucommon/memory.h:1316:70: error: no matching function for call to 'ucommon::keypager<T, M>::_alloc(long unsigned int) const'
434 node = init<T>(static_cast<T*>(mempager::_alloc(sizeof(T))));
435 ^
436 ../inc/ucommon/memory.h:240:19: note: candidate: virtual void* ucommon::mempager::_alloc(size_t) <near match>
437 virtual void *_alloc(size_t size);
438 ^~~~~~
439 ../inc/ucommon/memory.h:240:19: note: passing 'const ucommon::keypager<T, M>*' as 'this' argument discards qualifiers
440 make[2]: *** [Makefile:515: linked.lo] Error 1
441 make[2]: *** Waiting for unfinished jobs....
442 string.cpp: In member function 'ucommon::String::cstring* ucommon::String::create(ucommon::strsize_t, char) const':
443 string.cpp:344:52: error: exception cleanup for this placement new selects non-placement operator delete [-fpermissive]
444 return new((size_t)size) cstring(size, fill);
445 ^
446 <built-in>: note: 'void operator delete(void*, long unsigned int)' is a usual (non-placement) deallocation function in C++14 (or with -fsized-deallocation)
447 string.cpp:346:46: error: exception cleanup for this placement new selects non-placement operator delete [-fpermissive]
448 return new((size_t)size) cstring(size);
449 ^
450 <built-in>: note: 'void operator delete(void*, long unsigned int)' is a usual (non-placement) deallocation function in C++14 (or with -fsized-deallocation)
451 make[2]: *** [Makefile:515: string.lo] Error 1
452 make[2]: Leaving directory '/var/tmp/portage/dev-libs/ucommon-6.0.3/work/ucommon-6.0.3/corelib'
453 make[1]: *** [Makefile:619: all-recursive] Error 1
454 make[1]: Leaving directory '/var/tmp/portage/dev-libs/ucommon-6.0.3/work/ucommon-6.0.3'
455 make: *** [Makefile:440: all] Error 2
456 [31m*[0m ERROR: dev-libs/ucommon-6.0.3::gentoo failed (compile phase):
457 [31m*[0m emake failed
458 [31m*[0m
459 [31m*[0m If you need support, post the output of `emerge --info '=dev-libs/ucommon-6.0.3::gentoo'`,
460 [31m*[0m the complete build log and the output of `emerge -pqv '=dev-libs/ucommon-6.0.3::gentoo'`.
461 [31m*[0m The complete build log is located at '/var/tmp/portage/dev-libs/ucommon-6.0.3/temp/build.log'.
462 [31m*[0m The ebuild environment file is located at '/var/tmp/portage/dev-libs/ucommon-6.0.3/temp/environment'.
463 [31m*[0m Working directory: '/var/tmp/portage/dev-libs/ucommon-6.0.3/work/ucommon-6.0.3'
464 [31m*[0m S: '/var/tmp/portage/dev-libs/ucommon-6.0.3/work/ucommon-6.0.3'
466 Anybody an idea?
468 Trying version 6.5.7 do not help.
470 Regards
471 Klaus
472 - --
473 Klaus Ethgen
474 pub 4096R/4E20AF1C 2011-05-16 Klaus Ethgen <Klaus@××××××.ch>
475 Fingerprint: 85D4 CA42 952C 949B 1753 62B3 79D0 B06F 4E20 AF1C
477 Comment: Charset: ISO-8859-1
480 9qxYIQv7B4aOhyOLpeECe7cP8wexlEylBxBBS4DgGwNXCVJk11uKNzseAJ1ulusI
481 MA9aEspjUSSk0NSQPhWuwar/2GN0catDw2DfFJH+RvvRpbhnSPqhPjylIUDpKqpH
482 M1owXRVGjbSZNAIS16RVOjwt93vokELFpk+SW2/WPpWO0mgdjLicX4V83zFCML2c
483 xeTmNkWU5vNluub8F01FJzBNXCu67Sh3Rri9ZOOKuGZdAqiG81FSMEXFH8KiC1Vt
484 9d22GvBlduJui/JrpPsLwVZXUzPoR9Qckgu5MkVEkIcRCf/WwySOqjNV0uYGSGBB
485 HQlw4K2nfv2YQYKecSXhmXvaOLyTI+A57qxwL6URvVOqxkrpuGBcyRFcBDr6dppu
486 XhvWxZlMMNi+qjXn5wrHf5f0BUuWSLMroBGb0pk3E2vba4R5XI6fRP01vSo3HJw3
487 y1YsvKFSqRSbAqGSlZEBGF1Efhi1eZLq/z6sj80NGQkvwFQPnpnXCOQh0z8RH6H1
488 zyF32WCI
489 =UIdt
490 -----END PGP SIGNATURE-----